program: Orca
programVersion: 5.0.2
elementType: Cl S O O O O N N C C C C C C C C C C C C C H H H H H H H H H H H
charge: 0
multiplicity: 1
keywords: wb97x-d3
keywords: def2-TZVPP
keywords: def2/J RIJCOSX
keywords: DEFGRID2
keywords: scfconv7
keywords: smallprint printgap noloewdin
keywords: NOSOSCF
formula: C13H11ClN2O4S
InChI: InChI=1/C13H11ClN2O4S/c1-19-9-6-10(20-2)16-13(15-9)21-8-5-3-4-7(14)11(8)12(17)18/h3-6,17H,1-2H3
32 atoms
Cl -2.43491 -2.385066 -2.507305
S  -0.856278 1.109111 1.342701
O  3.267304 -1.09417 -0.254666
O  3.526499 3.2305 1.44159
O  -0.471921 0.542702 -2.013777
O  -2.657334 0.966744 -1.784509
N  1.394126 -0.053835 0.524701
N  1.515233 2.149774 1.36159
C  -1.332392 -0.520485 0.836748
C  -1.669413 -0.766636 -0.4902
C  -1.395732 -1.536398 1.777965
C  -2.043468 -2.050239 -0.85973
C  -1.779831 -2.810352 1.392873
C  -2.098821 -3.074597 0.07186
C  0.881361 1.039892 1.036655
C  2.698306 -0.029948 0.286557
C  2.821547 2.153233 1.135025
C  3.492211 1.070033 0.579725
C  -1.679013 0.345728 -1.49232
C  2.428809 -2.1870 -0.603038
C  2.844554 4.338804 2.006288
H  -1.13913 -1.324707 2.806519
H  -1.830216 -3.605741 2.123921
H  -2.396078 -4.0669 -0.237455
H  4.554388 1.085045 0.388652
H  1.654282 -1.891109 -1.311762
H  1.944425 -2.621713 0.272274
H  3.084041 -2.924069 -1.060998
H  3.603584 5.100953 2.163188
H  2.379744 4.085844 2.959668
H  2.073004 4.723821 1.338988
H  -0.526048 1.27554 -2.642643
totalener: -1770.91924916 hartree
nucrepener: 1991.72258797 hartree
electener: -3762.64183713 hartree
oneelecener: -6391.10974455 hartree
twoeener: 2628.46790742 hartree
kineticenergy: 1766.05940078 hartree
xcener: -125.435124516983 hartree
chargesum: 0.0000000
charge: -0.052401 -0.019037 -0.268993 -0.267345 -0.229944 -0.302073 -0.378771 -0.360142 0.101966 0.009215 -0.116827 0.070008 -0.127752 -0.145780 0.207811 0.382407 0.400389 -0.308420 0.275312 -0.114156 -0.117336 0.118097 0.131124 0.123025 0.124998 0.104624 0.101011 0.122154 0.118843 0.107785 0.106940 0.203268
qa: -0.0524 -0.0190 -0.2690 -0.2673 -0.2299 -0.3021 -0.3788 -0.3601 0.1020 0.0092 -0.1168 0.0700 -0.1278 -0.1458 0.2078 0.3824 0.4004 -0.3084 0.2753 -0.1142 -0.1173 0.1181 0.1311 0.1230 0.1250 0.1046 0.1010 0.1222 0.1188 0.1078 0.1069 0.2033
va: 1.2695 2.4003 2.1449 2.1391 2.1971 2.1890 2.9577 2.9750 3.8410 3.6538 4.0458 3.9669 3.9625 4.0295 4.2518 4.0601 4.0218 3.9405 4.3704 3.8874 3.8728 1.0129 0.9980 1.0125 1.0225 0.9964 0.9953 0.9952 0.9930 0.9984 0.9994 1.0394
dispcorr: -0.016732604 hartree
energy: -1770.935981760530
dipole: 14.91079 -14.01732 0.89347 3.35373 -3.98593 -0.63220 9.29571 -8.88782 0.40789
magnitude: 1.16805 au
magnitude: 2.96894 debye
