program: Orca
programVersion: 5.0.2
elementType: Cl S O O O O N N C C C C C C C C C C C C C H H H H H H H H H H H
charge: 0
multiplicity: 1
keywords: wb97x-d3
keywords: def2-TZVPP
keywords: def2/J RIJCOSX
keywords: DEFGRID2
keywords: scfconv7
keywords: smallprint printgap noloewdin
keywords: NOSOSCF
formula: C13H11ClN2O4S
InChI: InChI=1/C13H11ClN2O4S/c1-19-9-6-10(20-2)16-13(15-9)21-8-5-3-4-7(14)11(8)12(17)18/h3-6,17H,1-2H3
32 atoms
Cl -3.944978 1.061423 -1.047324
S  0.512102 -2.005533 -0.38819
O  4.823664 0.216754 0.112832
O  1.036432 2.490318 1.576366
O  -1.260552 -0.773583 -2.869265
O  -0.775374 1.18614 -1.907832
N  2.762603 -0.753193 -0.071121
N  0.851939 0.391516 0.70859
C  -1.104098 -1.484559 0.117878
C  -1.808475 -0.533308 -0.617663
C  -1.659161 -2.037931 1.260685
C  -3.055971 -0.128616 -0.167018
C  -2.918845 -1.640447 1.680924
C  -3.62045 -0.68178 0.972145
C  1.470749 -0.623305 0.157078
C  3.514501 0.274059 0.301925
C  1.611044 1.423554 1.051601
C  2.988556 1.423162 0.879433
C  -1.217256 0.075793 -1.849342
C  5.362839 -0.942899 -0.49917
C  -0.384613 2.521407 1.62645
H  -1.096302 -2.769062 1.824077
H  -3.354914 -2.073491 2.570726
H  -4.601406 -0.362208 1.294894
H  3.60672 2.26209 1.160514
H  5.185847 -1.836924 0.099593
H  6.432187 -0.763513 -0.576134
H  4.948469 -1.107319 -1.494166
H  -0.784005 1.737247 2.27037
H  -0.821756 2.412716 0.633794
H  -0.639883 3.49497 2.036976
H  -0.838738 -0.359905 -3.635222
totalener: -1770.91928722 hartree
nucrepener: 2006.29838921 hartree
electener: -3777.21767643 hartree
oneelecener: -6420.59968081 hartree
twoeener: 2643.38200438 hartree
kineticenergy: 1766.06374135 hartree
xcener: -125.437568703545 hartree
chargesum: -0.0000000
charge: -0.051197 -0.018572 -0.267877 -0.269234 -0.235336 -0.311661 -0.365449 -0.378974 0.070826 0.029473 -0.117825 0.054080 -0.119756 -0.142741 0.210464 0.404183 0.395649 -0.310799 0.293536 -0.118077 -0.115087 0.119523 0.130535 0.121973 0.124069 0.106338 0.118722 0.106181 0.097470 0.113795 0.120529 0.205239
qa: -0.0512 -0.0186 -0.2679 -0.2692 -0.2353 -0.3117 -0.3654 -0.3790 0.0708 0.0295 -0.1178 0.0541 -0.1198 -0.1427 0.2105 0.4042 0.3956 -0.3108 0.2935 -0.1181 -0.1151 0.1195 0.1305 0.1220 0.1241 0.1063 0.1187 0.1062 0.0975 0.1138 0.1205 0.2052
va: 1.2699 2.4094 2.1383 2.1503 2.2224 2.1542 2.9777 2.9642 3.8622 3.6325 4.0452 3.9561 3.9686 4.0330 4.2647 4.0173 4.0580 3.9490 4.3327 3.8755 3.8733 1.0148 0.9981 1.0135 1.0228 0.9985 0.9930 0.9994 0.9959 1.0023 0.9956 1.0401
dispcorr: -0.017187843 hartree
energy: -1770.936475066592
dipole: 13.26571 -13.47165 -0.20594 -0.46579 -0.05343 -0.51922 7.86186 -7.48448 0.37738
magnitude: 0.67410 au
magnitude: 1.71343 debye
