program: Orca
programVersion: 5.0.2
elementType: S F F O O O O O O N N N C C C C C C C C C C C C C C C C H H H H H H H H H H H H H H H H H H H
charge: 0
multiplicity: 1
keywords: wb97x-d3
keywords: def2-TZVPP
keywords: def2/J RIJCOSX
keywords: DEFGRID2
keywords: scfconv7
keywords: smallprint printgap noloewdin
keywords: NOSOSCF
formula: C16H19F2N3O6S
InChI: InChI=1/C16H19F2N3O6S/c1-25-8-9-5-4-6-10(13(9)21-28(23,24)16(17)18)14(22)15-19-11(26-2)7-12(20-15)27-3/h4-7,14,16,21-22H,8H2,1-3H3
47 atoms
S  -1.578119 -0.381107 -2.213763
F  -1.40887 -2.942813 -1.930992
F  -2.725957 -2.247034 -3.522076
O  1.411068 3.176014 -0.604629
O  -2.820005 -1.725179 1.077296
O  -0.511462 -0.454659 -3.19848
O  -2.648439 0.589885 -2.350537
O  4.860246 1.371317 2.066291
O  2.490098 -2.407633 0.775056
N  -0.954581 -0.28402 -0.711512
N  2.947472 1.589798 0.819937
N  1.746502 -0.325103 0.165252
C  -0.36292 1.816366 0.352607
C  -1.273058 0.76615 0.197698
C  0.92619 1.871968 -0.458428
C  -2.427282 0.695818 0.980966
C  -0.627187 2.80972 1.287312
C  -2.669944 1.713282 1.896024
C  -3.40095 -0.454503 0.903555
C  -1.783873 2.767123 2.046513
C  1.952136 0.980559 0.215653
C  -2.352546 -2.043281 -2.24803
C  3.837155 0.817052 1.439016
C  2.636366 -1.093678 0.785636
C  3.732315 -0.564573 1.4526
C  -2.166394 -1.883527 2.316877
C  4.977824 2.793154 2.079278
C  1.354507 -2.972891 0.121397
H  0.742571 1.472435 -1.460303
H  0.069009 3.626083 1.423217
H  0.007186 -0.639002 -0.619967
H  -3.559691 1.666173 2.511544
H  -3.90772 -0.4712 -0.063896
H  -4.181829 -0.287933 1.656553
H  -1.985532 3.546063 2.769625
H  -3.208662 -2.121509 -1.579701
H  2.090071 3.312015 0.073684
H  4.45545 -1.191548 1.954424
H  -1.883764 -2.931576 2.408175
H  -1.258702 -1.276649 2.396415
H  -2.819723 -1.627973 3.159201
H  4.131939 3.261767 2.581377
H  5.072842 3.199846 1.07301
H  5.885502 3.005604 2.637353
H  0.425746 -2.680458 0.612569
H  1.47435 -4.049508 0.205396
H  1.319537 -2.699051 -0.932808
elementType: S F O N C H
totalener: -1834.78289796 hartree
nucrepener: 3187.52745671 hartree
electener: -5022.31035468 hartree
oneelecener: -8860.27072633 hartree
twoeener: 3837.96037165 hartree
cpcmener: -0.04686883 hartree
kineticenergy: 1828.17139862 hartree
xcener: -149.493961497586 hartree
chargesum: 0.0000000
charge: 0.850689 -0.176487 -0.179369 -0.441757 -0.383055 -0.520942 -0.512334 -0.299243 -0.299314 -0.187225 -0.430330 -0.436476 -0.010680 -0.005376 0.207094 -0.050839 -0.142686 -0.072016 -0.047383 -0.180789 0.260333 0.271395 0.405294 0.427344 -0.301630 -0.128460 -0.116069 -0.101974 0.125170 0.146467 0.217582 0.142066 0.118350 0.112116 0.161123 0.143876 0.246156 0.145935 0.122920 0.093119 0.114902 0.115474 0.114877 0.134011 0.099612 0.137362 0.111164
qa: 0.8507 -0.1765 -0.1794 -0.4418 -0.3831 -0.5209 -0.5123 -0.2992 -0.2993 -0.1872 -0.4303 -0.4365 -0.0107 -0.0054 0.2071 -0.0508 -0.1427 -0.0720 -0.0474 -0.1808 0.2603 0.2714 0.4053 0.4273 -0.3016 -0.1285 -0.1161 -0.1020 0.1252 0.1465 0.2176 0.1421 0.1184 0.1121 0.1611 0.1439 0.2462 0.1459 0.1229 0.0931 0.1149 0.1155 0.1149 0.1340 0.0996 0.1374 0.1112
va: 5.7622 1.1109 1.1098 2.0112 1.8530 1.9753 1.9679 2.1282 2.1328 2.9990 2.9710 2.9824 3.5916 3.9509 3.8769 3.6591 3.9283 3.8504 3.8636 3.9683 4.0528 4.1399 4.0176 3.9972 3.9449 3.9005 3.8424 3.8444 1.0435 1.0160 1.0533 1.0023 0.9945 1.0048 0.9912 0.9840 1.0196 1.0167 0.9899 0.9802 0.9949 0.9946 0.9940 0.9934 0.9846 0.9956 1.0019
dispcorr: -0.029825840 hartree
energy: -1834.812723803886
dipole: 6.67269 -5.84445 0.82824 7.32686 -7.74971 -0.42286 25.55935 -21.56558 3.99378
magnitude: 4.10062 au
magnitude: 10.42294 debye
