program: Orca
programVersion: 5.0.2
elementType: S F F O O O O O O N N N C C C C C C C C C C C C C C C C H H H H H H H H H H H H H H H H H H H
charge: 0
multiplicity: 1
keywords: wb97x-d3
keywords: def2-TZVPP
keywords: def2/J RIJCOSX
keywords: DEFGRID2
keywords: scfconv7
keywords: smallprint printgap noloewdin
keywords: NOSOSCF
formula: C16H19F2N3O6S
InChI: InChI=1/C16H19F2N3O6S/c1-25-8-9-5-4-6-10(13(9)21-28(23,24)16(17)18)14(22)15-19-11(26-2)7-12(20-15)27-3/h4-7,14,16,21-22H,8H2,1-3H3
47 atoms
S  -1.591927 -0.427998 -2.159396
F  -1.3907 -2.988781 -1.867161
F  -2.780859 -2.308835 -3.403423
O  1.419292 3.171878 -0.575039
O  -2.899782 -1.682047 1.012018
O  -0.532375 -0.515831 -3.148999
O  -2.678239 0.521601 -2.304252
O  4.866933 1.37437 2.076312
O  2.533418 -2.409978 0.739577
N  -0.948396 -0.285197 -0.666665
N  2.955265 1.586343 0.83267
N  1.764887 -0.328948 0.16536
C  -0.357662 1.824665 0.37306
C  -1.273387 0.777457 0.223646
C  0.93253 1.874024 -0.438918
C  -2.441095 0.733558 0.990177
C  -0.625508 2.83554 1.287272
C  -2.685536 1.768555 1.885081
C  -3.443574 -0.391913 0.905327
C  -1.791271 2.815223 2.032839
C  1.961296 0.976999 0.226757
C  -2.35241 -2.095055 -2.147319
C  3.852662 0.816293 1.443366
C  2.66579 -1.097717 0.770301
C  3.758224 -0.566714 1.443139
C  -2.211023 -1.917076 2.215669
C  4.968521 2.7961 2.100704
C  1.416838 -2.977193 0.057693
H  0.741088 1.475288 -1.441048
H  0.072392 3.652122 1.412067
H  0.021496 -0.62081 -0.585077
H  -3.585595 1.74261 2.487297
H  -3.977774 -0.357548 -0.047377
H  -4.199474 -0.23154 1.685599
H  -1.996384 3.608482 2.739742
H  -3.17741 -2.176847 -1.441431
H  2.144935 3.281992 0.05877
H  4.488921 -1.193764 1.934462
H  -1.951938 -2.975167 2.24521
H  -1.286328 -1.33588 2.297959
H  -2.828722 -1.691877 3.093706
H  4.108043 3.253674 2.589459
H  5.077801 3.211089 1.098267
H  5.864106 3.015397 2.676463
H  0.475609 -2.706276 0.538166
H  1.549247 -4.054134 0.12414
H  1.396458 -2.684232 -0.992132
elementType: S F O N C H
totalener: -1834.78528601 hartree
nucrepener: 3188.81729244 hartree
electener: -5023.60257846 hartree
oneelecener: -8862.75531562 hartree
twoeener: 3839.15273716 hartree
cpcmener: -0.03754690 hartree
kineticenergy: 1828.19419947 hartree
xcener: -149.497722940462 hartree
chargesum: -0.0000000
charge: 0.844133 -0.178547 -0.179191 -0.420669 -0.366178 -0.508074 -0.500420 -0.290013 -0.290200 -0.187623 -0.431404 -0.433230 -0.006122 0.015512 0.181857 -0.049188 -0.146650 -0.075624 -0.052571 -0.179290 0.262997 0.268251 0.400191 0.421833 -0.298100 -0.126221 -0.118235 -0.103256 0.123297 0.142745 0.212208 0.137657 0.120085 0.107045 0.157174 0.138422 0.237181 0.144049 0.119172 0.089218 0.111349 0.113863 0.114765 0.133065 0.097223 0.135703 0.111812
qa: 0.8441 -0.1785 -0.1792 -0.4207 -0.3662 -0.5081 -0.5004 -0.2900 -0.2902 -0.1876 -0.4314 -0.4332 -0.0061 0.0155 0.1819 -0.0492 -0.1466 -0.0756 -0.0526 -0.1793 0.2630 0.2683 0.4002 0.4218 -0.2981 -0.1262 -0.1182 -0.1033 0.1233 0.1427 0.2122 0.1377 0.1201 0.1070 0.1572 0.1384 0.2372 0.1440 0.1192 0.0892 0.1113 0.1139 0.1148 0.1331 0.0972 0.1357 0.1118
va: 5.7800 1.1080 1.1090 2.0345 1.8748 1.9922 1.9839 2.1391 2.1436 2.9952 2.9689 2.9839 3.5597 3.9356 3.9150 3.6697 3.9383 3.8660 3.8578 3.9729 4.0490 4.1416 4.0259 4.0058 3.9404 3.9116 3.8469 3.8498 1.0427 1.0198 1.0597 1.0035 0.9952 1.0063 0.9927 0.9891 1.0302 1.0171 0.9900 0.9806 0.9946 0.9947 0.9937 0.9938 0.9854 0.9961 1.0018
dispcorr: -0.029831845 hartree
energy: -1834.815117858379
dipole: 6.82771 -5.84782 0.97989 7.64034 -8.02449 -0.38416 24.83967 -21.05854 3.78113
magnitude: 3.92489 au
magnitude: 9.97627 debye
