program: Orca
programVersion: 5.0.2
elementType: O O O O O O N N N C C C C C C C C C C C C C C C C C H H H H H H H H H H H H H H H H H H H
charge: 0
multiplicity: 1
keywords: wb97x-d3
keywords: def2-TZVPP
keywords: def2/J RIJCOSX
keywords: DEFGRID2
keywords: scfconv7
keywords: smallprint printgap noloewdin
keywords: NOSOSCF
formula: C17H19N3O6
InChI: InChI=1/C17H19N3O6/c1-10(20-25-5)11-7-6-8-12(15(11)16(21)24-4)26-17-18-13(22-2)9-14(19-17)23-3/h6-9H,1-5H3
45 atoms
O  1.039744 -1.558063 1.152685
O  -0.796228 1.272245 -0.62821
O  -0.042578 1.145679 1.47136
O  -4.253994 2.021656 0.634954
O  2.082557 0.264681 -2.903283
O  4.913045 0.723887 0.74591
N  -3.321202 1.047287 0.814972
N  1.543111 -0.71765 -0.906335
N  2.968434 -0.463475 0.961397
C  -2.476921 -1.025993 0.205753
C  -1.141457 -0.735637 0.505135
C  -0.262245 -1.786043 0.763885
C  -2.890637 -2.354077 0.140631
C  -3.476726 0.048181 0.037792
C  -0.677764 -3.102959 0.70022
C  -1.998468 -3.382471 0.388377
C  -0.623515 0.664117 0.528248
C  -4.577134 -0.098706 -0.962397
C  1.880971 -0.877162 0.350737
C  2.371343 0.024139 -1.634627
C  3.795611 0.256061 0.213323
C  3.540879 0.55925 -1.118209
C  -0.275597 2.595884 -0.761682
C  -3.961399 3.132644 1.463242
C  0.90463 -0.305969 -3.469578
C  5.190673 0.458784 2.118509
H  -3.923775 -2.585872 -0.081485
H  0.028718 -3.899163 0.893611
H  -2.332455 -4.409813 0.34175
H  -4.703703 0.8174 -1.538968
H  -5.530108 -0.305507 -0.471909
H  -4.374725 -0.907719 -1.658627
H  4.211394 1.164196 -1.71095
H  -0.762394 3.283923 -0.069555
H  -0.492136 2.899146 -1.781361
H  0.802266 2.616521 -0.599873
H  -3.005501 3.59042 1.200959
H  -4.756259 3.855383 1.295107
H  -3.949513 2.859381 2.519636
H  0.002788 0.052721 -2.97588
H  0.927354 -1.394762 -3.434866
H  0.894529 0.016102 -4.507223
H  5.290583 -0.608799 2.311987
H  6.138599 0.948111 2.324858
H  4.424628 0.874338 2.772579
elementType: O N C H
totalener: -1274.93271393 hartree
nucrepener: 2496.24140554 hartree
electener: -3771.17411948 hartree
oneelecener: -6705.08477221 hartree
twoeener: 2933.91065274 hartree
cpcmener: -0.04428518 hartree
kineticenergy: 1269.75977404 hartree
xcener: -119.068503101343 hartree
chargesum: -0.0000000
charge: -0.302232 -0.265757 -0.447879 -0.248985 -0.302986 -0.301850 -0.166998 -0.392083 -0.400862 0.009651 -0.014520 0.227995 -0.174006 0.195370 -0.188578 -0.128528 0.409434 -0.270796 0.352281 0.399950 0.441964 -0.323192 -0.131952 -0.110473 -0.113305 -0.114748 0.153792 0.152676 0.164219 0.104549 0.121442 0.102151 0.141288 0.129674 0.131618 0.120115 0.099993 0.120631 0.106639 0.107350 0.115888 0.133349 0.112885 0.131321 0.113504
qa: -0.3022 -0.2658 -0.4479 -0.2490 -0.3030 -0.3019 -0.1670 -0.3921 -0.4009 0.0097 -0.0145 0.2280 -0.1740 0.1954 -0.1886 -0.1285 0.4094 -0.2708 0.3523 0.4000 0.4420 -0.3232 -0.1320 -0.1105 -0.1133 -0.1147 0.1538 0.1527 0.1642 0.1045 0.1214 0.1022 0.1413 0.1297 0.1316 0.1201 0.1000 0.1206 0.1066 0.1073 0.1159 0.1333 0.1129 0.1313 0.1135
va: 2.0956 2.0982 2.0471 1.9373 2.1029 2.1181 2.8399 2.9014 2.9448 3.7942 3.6517 3.7180 3.9148 3.7097 4.0127 3.9091 4.1279 3.9500 4.3204 4.0023 3.9785 3.9279 3.8461 3.8930 3.8425 3.8474 0.9959 1.0004 0.9882 1.0083 0.9959 1.0042 1.0180 0.9934 0.9923 0.9938 0.9859 0.9935 0.9964 0.9964 0.9967 0.9939 0.9961 0.9936 0.9967
dispcorr: -0.024208727 hartree
energy: -1274.956922657662
dipole: -10.19256 9.05338 -1.13918 8.48577 -8.65941 -0.17364 -5.24446 3.30072 -1.94373
magnitude: 2.25964 au
magnitude: 5.74355 debye
