program: Orca
programVersion: 5.0.2
elementType: O O O O O O N N N C C C C C C C C C C C C C C C C C H H H H H H H H H H H H H H H H H H H
charge: 0
multiplicity: 1
keywords: wb97x-d3
keywords: def2-TZVPP
keywords: def2/J RIJCOSX
keywords: DEFGRID2
keywords: scfconv7
keywords: smallprint printgap noloewdin
keywords: NOSOSCF
formula: C17H19N3O6
InChI: InChI=1/C17H19N3O6/c1-10(20-25-5)11-7-6-8-12(15(11)16(21)24-4)26-17-18-13(22-2)9-14(19-17)23-3/h6-9H,1-5H3
45 atoms
O  0.593981 -1.227326 -1.289228
O  -1.476628 1.914812 -0.291565
O  -1.111571 0.797667 -2.191757
O  -4.715545 1.590474 2.326376
O  4.746495 -0.394149 -2.836307
O  3.805472 0.11104 1.679094
N  -3.626173 0.773088 2.223918
N  2.633273 -0.818372 -2.062565
N  2.151633 -0.539527 0.235223
C  -2.291188 -0.561246 0.863992
C  -1.309612 -0.391321 -0.124988
C  -0.325239 -1.361942 -0.27538
C  -2.23471 -1.679421 1.687396
C  -3.417034 0.390152 1.025692
C  -0.272289 -2.473403 0.548206
C  -1.230223 -2.623711 1.534271
C  -1.286139 0.815154 -0.997602
C  -4.274328 0.757458 -0.145205
C  1.851257 -0.841779 -1.005137
C  3.888325 -0.45551 -1.830078
C  3.416884 -0.193226 0.450537
C  4.359102 -0.13288 -0.563918
C  -1.587196 3.151131 -1.003749
C  -4.903034 1.989943 3.671568
C  4.288444 -0.675226 -4.156663
C  2.853814 0.048085 2.739825
H  -2.998879 -1.828093 2.437429
H  0.507297 -3.211394 0.412653
H  -1.203099 -3.49046 2.180473
H  -4.352969 1.837637 -0.275506
H  -5.287845 0.379313 0.007781
H  -3.910645 0.320997 -1.072764
H  5.385536 0.151806 -0.38455
H  -1.816111 3.903817 -0.255327
H  -2.390693 3.114543 -1.738997
H  -0.649597 3.405345 -1.497831
H  -5.763973 2.656033 3.673976
H  -5.114034 1.138592 4.322934
H  -4.037412 2.531758 4.059444
H  3.501231 0.012142 -4.465404
H  3.931355 -1.700242 -4.252153
H  5.152603 -0.538393 -4.801076
H  3.399987 0.321356 3.638875
H  2.035625 0.752392 2.590622
H  2.448661 -0.956433 2.85961
elementType: O N C H
totalener: -1274.93327783 hartree
nucrepener: 2398.51751874 hartree
electener: -3673.45079658 hartree
oneelecener: -6509.08777038 hartree
twoeener: 2835.63697380 hartree
cpcmener: -0.04326689 hartree
kineticenergy: 1269.71974918 hartree
xcener: -119.055344159503 hartree
chargesum: -0.0000000
charge: -0.308502 -0.262873 -0.455894 -0.247504 -0.302988 -0.303779 -0.177024 -0.411138 -0.421711 0.072664 -0.042926 0.261179 -0.207823 0.184499 -0.182984 -0.112736 0.381031 -0.272687 0.409425 0.426020 0.402294 -0.318783 -0.132646 -0.109233 -0.113714 -0.113244 0.144632 0.153092 0.164469 0.106793 0.124754 0.103910 0.143095 0.132067 0.121872 0.130071 0.115858 0.102987 0.102489 0.113423 0.112003 0.131160 0.132277 0.113771 0.112354
qa: -0.3085 -0.2629 -0.4559 -0.2475 -0.3030 -0.3038 -0.1770 -0.4111 -0.4217 0.0727 -0.0429 0.2612 -0.2078 0.1845 -0.1830 -0.1127 0.3810 -0.2727 0.4094 0.4260 0.4023 -0.3188 -0.1326 -0.1092 -0.1137 -0.1132 0.1446 0.1531 0.1645 0.1068 0.1248 0.1039 0.1431 0.1321 0.1219 0.1301 0.1159 0.1030 0.1025 0.1134 0.1120 0.1312 0.1323 0.1138 0.1124
va: 2.0942 2.1356 2.0365 1.9385 2.1151 2.1158 2.8436 2.9535 2.9089 3.6736 3.6965 3.7078 3.9885 3.7194 4.0050 3.9071 4.1910 3.9530 4.2304 3.9956 4.0407 3.9206 3.8444 3.8913 3.8472 3.8490 1.0154 0.9991 0.9875 1.0044 1.0010 1.0101 1.0167 0.9934 0.9915 0.9939 0.9934 0.9933 0.9954 0.9964 0.9964 0.9935 0.9944 0.9947 0.9932
dispcorr: -0.021103248 hartree
energy: -1274.954381082487
dipole: -10.67472 10.24378 -0.43093 8.56972 -8.23552 0.33420 6.92133 -5.47305 1.44828
magnitude: 1.54755 au
magnitude: 3.93355 debye
