program: Orca
programVersion: 5.0.2
elementType: O O O O O O N N N C C C C C C C C C C C C C C C C C H H H H H H H H H H H H H H H H H H H
charge: 0
multiplicity: 1
keywords: wb97x-d3
keywords: def2-TZVPP
keywords: def2/J RIJCOSX
keywords: DEFGRID2
keywords: scfconv7
keywords: smallprint printgap noloewdin
keywords: NOSOSCF
formula: C17H19N3O6
InChI: InChI=1/C17H19N3O6/c1-10(20-25-5)11-7-6-8-12(15(11)16(21)24-4)26-17-18-13(22-2)9-14(19-17)23-3/h6-9H,1-5H3
45 atoms
O  1.168524 0.607781 1.006444
O  -0.298618 1.382106 -1.1813
O  -2.061415 2.233291 -0.104592
O  -5.77638 0.095522 0.543654
O  5.176694 1.399816 -0.896344
O  3.007524 -2.631388 -1.651663
N  -4.581154 -0.123421 1.166239
N  3.132526 1.013844 0.059841
N  2.024729 -1.037006 -0.332944
C  -2.304082 -0.535596 0.965144
C  -1.141393 0.176702 0.638828
C  0.060764 -0.17613 1.239425
C  -2.219616 -1.586765 1.87053
C  -3.613132 -0.226675 0.342138
C  0.13748 -1.210429 2.15576
C  -1.010095 -1.917825 2.463633
C  -1.223591 1.374051 -0.243535
C  -3.754428 -0.158349 -1.146328
C  2.144872 0.156481 0.19856
C  4.135645 0.604376 -0.705999
C  3.042167 -1.431868 -1.091612
C  4.154958 -0.639214 -1.323893
C  -0.255088 2.509646 -2.062964
C  -6.820755 0.14984 1.498208
C  5.18261 2.690313 -0.290666
C  1.880353 -3.472102 -1.416492
H  -3.105997 -2.159721 2.104447
H  1.082532 -1.44956 2.625293
H  -0.96325 -2.734966 3.170525
H  -4.190938 0.785354 -1.474729
H  -4.418368 -0.955298 -1.489593
H  -2.801828 -0.295805 -1.652894
H  4.979801 -0.965956 -1.94015
H  0.579856 2.327765 -2.733112
H  -0.083967 3.434994 -1.512965
H  -1.174893 2.590487 -2.642415
H  -7.733985 0.346727 0.939185
H  -6.931684 -0.796925 2.033025
H  -6.670377 0.954367 2.222313
H  4.363497 3.310068 -0.654646
H  6.127067 3.144227 -0.578394
H  5.13245 2.628137 0.795895
H  1.75445 -3.693387 -0.3569
H  0.961492 -3.033536 -1.805326
H  2.088333 -4.395471 -1.950836
elementType: O N C H
totalener: -1274.93405682 hartree
nucrepener: 2401.06678124 hartree
electener: -3676.00083806 hartree
oneelecener: -6513.96798978 hartree
twoeener: 2837.96715172 hartree
cpcmener: -0.04100593 hartree
kineticenergy: 1269.71895008 hartree
xcener: -119.054643861080 hartree
chargesum: 0.0000000
charge: -0.312337 -0.268781 -0.455525 -0.246414 -0.302950 -0.303732 -0.176021 -0.409532 -0.413361 0.115623 -0.062870 0.282402 -0.211902 0.153078 -0.208762 -0.108284 0.408360 -0.267535 0.395565 0.426043 0.400834 -0.318483 -0.132772 -0.109227 -0.114637 -0.113108 0.144905 0.153530 0.164864 0.111473 0.120591 0.100929 0.143886 0.126352 0.124102 0.126486 0.115585 0.103518 0.102936 0.113756 0.131369 0.112149 0.111493 0.114232 0.132172
qa: -0.3123 -0.2688 -0.4555 -0.2464 -0.3030 -0.3037 -0.1760 -0.4095 -0.4134 0.1156 -0.0629 0.2824 -0.2119 0.1531 -0.2088 -0.1083 0.4084 -0.2675 0.3956 0.4260 0.4008 -0.3185 -0.1328 -0.1092 -0.1146 -0.1131 0.1449 0.1535 0.1649 0.1115 0.1206 0.1009 0.1439 0.1264 0.1241 0.1265 0.1156 0.1035 0.1029 0.1138 0.1314 0.1121 0.1115 0.1142 0.1322
va: 2.0838 2.1438 2.0442 1.9414 2.1154 2.1156 2.8443 2.9354 2.9048 3.6378 3.7615 3.7083 3.9792 3.7315 4.0066 3.9033 4.1255 3.9474 4.2380 3.9921 4.0409 3.9238 3.8619 3.8901 3.8484 3.8500 1.0160 1.0005 0.9874 1.0058 1.0023 1.0104 1.0165 0.9953 0.9918 0.9914 0.9937 0.9932 0.9953 0.9958 0.9932 0.9967 0.9935 0.9947 0.9941
dispcorr: -0.021292747 hartree
energy: -1274.955349566984
dipole: -10.16420 10.91981 0.75560 -0.95405 -0.38659 -1.34065 -5.03173 4.16031 -0.87142
magnitude: 1.76851 au
magnitude: 4.49520 debye
