program: Orca
programVersion: 5.0.2
elementType: O O O O O O N N N C C C C C C C C C C C C C C C C C H H H H H H H H H H H H H H H H H H H
charge: 0
multiplicity: 1
keywords: wb97x-d3
keywords: def2-TZVPP
keywords: def2/J RIJCOSX
keywords: DEFGRID2
keywords: scfconv7
keywords: smallprint printgap noloewdin
keywords: NOSOSCF
formula: C17H19N3O6
InChI: InChI=1/C17H19N3O6/c1-10(20-25-5)11-7-6-8-12(15(11)16(21)24-4)26-17-18-13(22-2)9-14(19-17)23-3/h6-9H,1-5H3
45 atoms
O  0.543326 -1.109202 -1.250518
O  -2.421135 0.759009 -1.394931
O  -0.525752 1.5396 -0.498075
O  -4.0882 1.926758 1.900698
O  4.440942 0.535361 -2.81287
O  3.82098 -0.030591 1.751186
N  -3.078337 1.129872 1.462435
N  2.454624 -0.292774 -2.029984
N  2.140788 -0.576914 0.295257
C  -2.253677 -1.013078 1.093331
C  -1.319009 -0.619023 0.126663
C  -0.296285 -1.486238 -0.22334
C  -2.118363 -2.269744 1.677827
C  -3.33771 -0.116705 1.54284
C  -0.170081 -2.738323 0.350271
C  -1.08932 -3.122677 1.310115
C  -1.377625 0.689752 -0.591496
C  -4.608949 -0.698231 2.072559
C  1.769733 -0.636143 -0.961065
C  3.677163 0.16682 -1.795961
C  3.368619 -0.115802 0.5096
C  4.208585 0.282756 -0.518026
C  -2.616862 1.978394 -2.115951
C  -3.780587 3.28888 1.66242
C  3.932246 0.419152 -4.139321
C  2.975875 -0.439991 2.823668
H  -2.818571 -2.589513 2.43753
H  0.627451 -3.401185 0.041666
H  -1.004582 -4.094175 1.777338
H  -4.780532 -1.696133 1.676346
H  -5.467647 -0.08132 1.814089
H  -4.578053 -0.773505 3.161695
H  5.206632 0.654975 -0.338729
H  -3.52669 1.839623 -2.692029
H  -1.787364 2.176878 -2.793861
H  -2.745102 2.821716 -1.4372
H  -3.68665 3.501037 0.594891
H  -4.614181 3.861789 2.063466
H  -2.863494 3.592925 2.170906
H  4.726799 0.774704 -4.789743
H  3.04644 1.035776 -4.288333
H  3.699506 -0.614608 -4.393583
H  2.693773 -1.489087 2.738879
H  3.562613 -0.300906 3.727558
H  2.075873 0.171402 2.884876
elementType: O N C H
totalener: -1274.93448892 hartree
nucrepener: 2423.82775451 hartree
electener: -3698.76224343 hartree
oneelecener: -6560.86622708 hartree
twoeener: 2862.10398365 hartree
cpcmener: -0.04429093 hartree
kineticenergy: 1269.74691467 hartree
xcener: -119.064493522301 hartree
chargesum: 0.0000000
charge: -0.313694 -0.267853 -0.466294 -0.254610 -0.303391 -0.303327 -0.155119 -0.407827 -0.411944 0.057977 -0.090837 0.304984 -0.184427 0.183842 -0.207611 -0.118260 0.414241 -0.270017 0.387561 0.426955 0.401736 -0.318851 -0.132976 -0.114317 -0.114426 -0.114433 0.154296 0.154288 0.164330 0.103838 0.103473 0.123704 0.143578 0.132409 0.125871 0.117624 0.104250 0.123190 0.106690 0.131366 0.113217 0.112409 0.112359 0.131881 0.114147
qa: -0.3137 -0.2679 -0.4663 -0.2546 -0.3034 -0.3033 -0.1551 -0.4078 -0.4119 0.0580 -0.0908 0.3050 -0.1844 0.1838 -0.2076 -0.1183 0.4142 -0.2700 0.3876 0.4270 0.4017 -0.3189 -0.1330 -0.1143 -0.1144 -0.1144 0.1543 0.1543 0.1643 0.1038 0.1035 0.1237 0.1436 0.1324 0.1259 0.1176 0.1042 0.1232 0.1067 0.1314 0.1132 0.1124 0.1124 0.1319 0.1141
va: 2.0819 2.1267 2.0281 1.9380 2.1148 2.1161 2.8486 2.9472 2.9034 3.7750 3.8330 3.6598 3.9336 3.7590 4.0284 3.8996 4.1804 3.9461 4.2527 3.9938 4.0407 3.9221 3.8489 3.8957 3.8477 3.8497 0.9949 0.9992 0.9882 1.0018 1.0140 0.9944 1.0165 0.9942 0.9951 0.9895 0.9813 0.9934 0.9954 0.9934 0.9962 0.9965 0.9933 0.9945 0.9949
dispcorr: -0.021370959 hartree
energy: -1274.955859879027
dipole: -11.48114 10.14574 -1.33540 5.61944 -6.52857 -0.90914 4.16862 -3.59743 0.57119
magnitude: 1.71350 au
magnitude: 4.35537 debye
