program: Orca
programVersion: 5.0.2
elementType: O O O O O O N N N C C C C C C C C C C C C C C C C C H H H H H H H H H H H H H H H H H H H
charge: 0
multiplicity: 1
keywords: wb97x-d3
keywords: def2-TZVPP
keywords: def2/J RIJCOSX
keywords: DEFGRID2
keywords: scfconv7
keywords: smallprint printgap noloewdin
keywords: NOSOSCF
formula: C17H19N3O6
InChI: InChI=1/C17H19N3O6/c1-10(20-25-5)11-7-6-8-12(15(11)16(21)24-4)26-17-18-13(22-2)9-14(19-17)23-3/h6-9H,1-5H3
45 atoms
O  0.94641 -0.990405 0.979939
O  -0.47375 1.595506 0.507884
O  -1.386883 0.916649 2.435279
O  -4.609293 1.941567 0.350287
O  2.696617 -0.434743 -3.210221
O  5.166259 0.54981 0.593412
N  -3.517168 1.138166 0.278728
N  1.761608 -0.71097 -1.13899
N  3.021333 -0.222992 0.799657
C  -2.599236 -0.988552 0.13318
C  -1.335757 -0.568341 0.570427
C  -0.252226 -1.419862 0.447565
C  -2.717576 -2.258022 -0.425915
C  -3.78237 -0.10767 0.216914
C  -0.372838 -2.68589 -0.099064
C  -1.617851 -3.096062 -0.539595
C  -1.103251 0.729728 1.278015
C  -5.151956 -0.70525 0.198716
C  1.947804 -0.626404 0.155948
C  2.799128 -0.361549 -1.892515
C  4.044084 0.128698 0.031137
C  3.999404 0.076578 -1.355967
C  -0.170739 2.876154 1.070034
C  -4.211657 3.28422 0.570347
C  1.485154 -0.920028 -3.784342
C  5.23993 0.631258 2.0143
H  -3.677339 -2.602977 -0.785326
H  0.487497 -3.338265 -0.166394
H  -1.736223 -4.079571 -0.973026
H  -5.484468 -0.875104 -0.82762
H  -5.883971 -0.059069 0.676902
H  -5.164178 -1.666088 0.709451
H  4.840875 0.357529 -1.972313
H  0.496916 2.787315 1.92635
H  -1.081028 3.398879 1.365186
H  0.325447 3.435961 0.283591
H  -3.588587 3.661012 -0.243135
H  -5.128886 3.868256 0.611916
H  -3.677648 3.395942 1.516563
H  1.642922 -0.900998 -4.859133
H  0.636099 -0.283835 -3.536511
H  1.272496 -1.942525 -3.473208
H  4.503846 1.326185 2.417637
H  5.110195 -0.343984 2.482864
H  6.237415 1.001513 2.234967
elementType: O N C H
totalener: -1274.93365459 hartree
nucrepener: 2430.88667079 hartree
electener: -3705.82032538 hartree
oneelecener: -6574.30035908 hartree
twoeener: 2868.48003370 hartree
cpcmener: -0.04305129 hartree
kineticenergy: 1269.74902995 hartree
xcener: -119.065647691974 hartree
chargesum: 0.0000000
charge: -0.313113 -0.270920 -0.462722 -0.262547 -0.302963 -0.302895 -0.142259 -0.411676 -0.409023 0.044914 -0.091287 0.274843 -0.177971 0.174242 -0.209596 -0.121663 0.444523 -0.255748 0.391001 0.402885 0.427138 -0.319236 -0.138239 -0.117890 -0.113289 -0.114896 0.153646 0.153021 0.164168 0.120809 0.103068 0.106831 0.143722 0.123749 0.121641 0.131598 0.107885 0.125805 0.106775 0.132980 0.113339 0.112046 0.113435 0.112554 0.131313
qa: -0.3131 -0.2709 -0.4627 -0.2625 -0.3030 -0.3029 -0.1423 -0.4117 -0.4090 0.0449 -0.0913 0.2748 -0.1780 0.1742 -0.2096 -0.1217 0.4445 -0.2557 0.3910 0.4029 0.4271 -0.3192 -0.1382 -0.1179 -0.1133 -0.1149 0.1536 0.1530 0.1642 0.1208 0.1031 0.1068 0.1437 0.1237 0.1216 0.1316 0.1079 0.1258 0.1068 0.1330 0.1133 0.1120 0.1134 0.1126 0.1313
va: 2.0858 2.1203 2.0313 1.9375 2.1165 2.1152 2.8528 2.9125 2.9428 3.8028 3.8065 3.7105 3.9258 3.8093 4.0126 3.9043 4.1597 3.9373 4.2523 4.0399 3.9931 3.9218 3.8597 3.8868 3.8476 3.8488 0.9951 1.0007 0.9885 0.9951 1.0192 0.9998 1.0166 0.9947 0.9918 0.9950 0.9921 0.9941 0.9913 0.9942 0.9954 0.9935 0.9958 0.9964 0.9935
dispcorr: -0.021799915 hartree
energy: -1274.955454507239
dipole: -9.19552 8.92185 -0.27367 6.99543 -7.25585 -0.26042 -2.72720 1.04984 -1.67736
magnitude: 1.71938 au
magnitude: 4.37030 debye
