program: Orca
programVersion: 5.0.2
elementType: O O O O O O N N N C C C C C C C C C C C C C C C C C H H H H H H H H H H H H H H H H H H H
charge: 0
multiplicity: 1
keywords: wb97x-d3
keywords: def2-TZVPP
keywords: def2/J RIJCOSX
keywords: DEFGRID2
keywords: scfconv7
keywords: smallprint printgap noloewdin
keywords: NOSOSCF
formula: C17H19N3O6
InChI: InChI=1/C17H19N3O6/c1-10(20-25-5)11-7-6-8-12(15(11)16(21)24-4)26-17-18-13(22-2)9-14(19-17)23-3/h6-9H,1-5H3
45 atoms
O  0.951228 -1.001443 0.990277
O  -0.482244 1.598807 0.493183
O  -1.352464 0.913943 2.438547
O  -4.576482 1.9605 0.316079
O  2.66333 -0.391942 -3.207304
O  5.178764 0.512791 0.586777
N  -3.494043 1.143778 0.267526
N  1.748276 -0.696411 -1.131575
N  3.029644 -0.245114 0.801715
C  -2.592701 -0.989157 0.136097
C  -1.328462 -0.571861 0.574629
C  -0.249332 -1.428892 0.45988
C  -2.716155 -2.262594 -0.412495
C  -3.770019 -0.099377 0.203767
C  -0.374184 -2.698135 -0.078397
C  -1.62029 -3.10685 -0.517174
C  -1.089467 0.728599 1.276211
C  -5.143852 -0.685613 0.167357
C  1.94739 -0.631854 0.162592
C  2.780335 -0.34161 -1.88959
C  4.047316 0.111088 0.028753
C  3.988602 0.080796 -1.35846
C  -0.186168 2.885071 1.044857
C  -4.163912 3.301963 0.516136
C  1.439617 -0.853344 -3.77538
C  5.267596 0.566796 2.00831
H  -3.677077 -2.606537 -0.769566
H  0.484045 -3.353744 -0.141108
H  -1.742319 -4.092452 -0.944596
H  -5.45704 -0.867934 -0.862834
H  -5.879948 -0.027064 0.621719
H  -5.174291 -1.638886 0.691587
H  4.824822 0.368071 -1.978823
H  0.512441 2.808098 1.877182
H  -1.093415 3.391816 1.373455
H  0.272491 3.454216 0.241976
H  -5.070351 3.903503 0.494986
H  -3.674971 3.433167 1.483682
H  -3.494101 3.641948 -0.276218
H  1.58453 -0.815867 -4.851579
H  0.600063 -0.213276 -3.505319
H  1.220353 -1.879049 -3.479964
H  4.539725 1.257736 2.432554
H  5.136942 -0.416648 2.45909
H  6.269521 0.926757 2.225452
elementType: O N C H
totalener: -1274.93361664 hartree
nucrepener: 2432.76798474 hartree
electener: -3707.70160138 hartree
oneelecener: -6578.05840640 hartree
twoeener: 2870.35680502 hartree
cpcmener: -0.04319499 hartree
kineticenergy: 1269.75521634 hartree
xcener: -119.066937841873 hartree
chargesum: -0.0000000
charge: -0.313191 -0.270784 -0.462028 -0.263122 -0.303103 -0.303071 -0.139907 -0.411761 -0.409017 0.044648 -0.094845 0.275217 -0.178342 0.172367 -0.209332 -0.122111 0.447591 -0.254771 0.390604 0.402394 0.427028 -0.318731 -0.139916 -0.119427 -0.113181 -0.114961 0.153104 0.153737 0.164240 0.120431 0.103059 0.107170 0.143784 0.125027 0.121264 0.132007 0.126601 0.107952 0.107801 0.132799 0.113268 0.111994 0.113534 0.112661 0.131319
qa: -0.3132 -0.2708 -0.4620 -0.2631 -0.3031 -0.3031 -0.1399 -0.4118 -0.4090 0.0446 -0.0948 0.2752 -0.1783 0.1724 -0.2093 -0.1221 0.4476 -0.2548 0.3906 0.4024 0.4270 -0.3187 -0.1399 -0.1194 -0.1132 -0.1150 0.1531 0.1537 0.1642 0.1204 0.1031 0.1072 0.1438 0.1250 0.1213 0.1320 0.1266 0.1080 0.1078 0.1328 0.1133 0.1120 0.1135 0.1127 0.1313
va: 2.0852 2.1190 2.0327 1.9384 2.1164 2.1152 2.8535 2.9096 2.9435 3.8042 3.8064 3.7090 3.9269 3.8159 4.0190 3.9052 4.1586 3.9372 4.2511 4.0402 3.9932 3.9217 3.8583 3.8868 3.8480 3.8485 0.9954 0.9999 0.9885 0.9952 1.0194 0.9996 1.0166 0.9947 0.9923 0.9948 0.9941 0.9904 0.9923 0.9942 0.9954 0.9936 0.9959 0.9963 0.9935
dispcorr: -0.021847056 hartree
energy: -1274.955463696292
dipole: -9.21849 8.90344 -0.31505 7.09484 -7.32997 -0.23513 -2.93438 1.22773 -1.70665
magnitude: 1.75134 au
magnitude: 4.45156 debye
