program: Orca
programVersion: 5.0.2
elementType: O O O O O O N N N C C C C C C C C C C C C C C C C C H H H H H H H H H H H H H H H H H H H
charge: 0
multiplicity: 1
keywords: wb97x-d3
keywords: def2-TZVPP
keywords: def2/J RIJCOSX
keywords: DEFGRID2
keywords: scfconv7
keywords: smallprint printgap noloewdin
keywords: NOSOSCF
formula: C17H19N3O6
InChI: InChI=1/C17H19N3O6/c1-10(20-25-5)11-7-6-8-12(15(11)16(21)24-4)26-17-18-13(22-2)9-14(19-17)23-3/h6-9H,1-5H3
45 atoms
O  1.036531 -0.403769 1.429318
O  -0.546727 1.431644 -0.22815
O  -1.636001 1.692037 1.709426
O  -4.70737 1.152919 -0.671852
O  4.731119 1.788304 0.050026
O  2.810988 -1.460515 -2.651907
N  -3.544755 0.534753 -0.337864
N  2.853259 0.685824 0.758914
N  1.87295 -0.960191 -0.624657
C  -2.432256 -1.229213 0.668614
C  -1.249994 -0.503541 0.854162
C  -0.078936 -1.173657 1.165076
C  -2.389355 -2.614799 0.794843
C  -3.695406 -0.557107 0.30299
C  -0.036826 -2.549509 1.297234
C  -1.205013 -3.266792 1.104627
C  -1.199775 0.991633 0.830309
C  -5.003353 -1.175907 0.673486
C  1.955589 -0.227153 0.459448
C  3.787553 0.884343 -0.162785
C  2.819649 -0.751358 -1.533546
C  3.829092 0.182282 -1.36044
C  -0.378659 2.846091 -0.359092
C  -4.434166 2.447255 -1.182016
C  4.730027 2.516098 1.275826
C  1.796322 -2.44627 -2.833641
H  -3.287224 -3.198329 0.642213
H  0.888768 -3.046486 1.555284
H  -1.194151 -4.344122 1.19624
H  -4.906308 -1.785935 1.568676
H  -5.368267 -1.820967 -0.128699
H  -5.765951 -0.421906 0.857951
H  4.596622 0.350021 -2.101765
H  -1.343295 3.345828 -0.453305
H  0.193248 2.993596 -1.270214
H  0.171434 3.261797 0.484428
H  -5.396538 2.874816 -1.45624
H  -3.965165 3.084617 -0.429064
H  -3.797732 2.407489 -2.068239
H  4.843656 1.85784 2.136575
H  3.824063 3.110293 1.392551
H  5.587388 3.181396 1.221279
H  0.800518 -2.003912 -2.844624
H  1.996473 -2.897498 -3.801683
H  1.840775 -3.216578 -2.064259
elementType: O N C H
totalener: -1274.93348130 hartree
nucrepener: 2448.22605191 hartree
electener: -3723.15953321 hartree
oneelecener: -6608.99153018 hartree
twoeener: 2885.83199697 hartree
cpcmener: -0.04248194 hartree
kineticenergy: 1269.75292724 hartree
xcener: -119.065174660432 hartree
chargesum: -0.0000000
charge: -0.314583 -0.272387 -0.460408 -0.260238 -0.302535 -0.303847 -0.151877 -0.402674 -0.408034 0.052320 -0.074322 0.280806 -0.183952 0.177200 -0.215249 -0.117036 0.433718 -0.259800 0.373597 0.431869 0.408406 -0.325266 -0.139838 -0.116440 -0.114348 -0.113557 0.154702 0.151825 0.164595 0.105603 0.121960 0.102112 0.143028 0.125577 0.131472 0.122780 0.125326 0.106540 0.107371 0.112821 0.112375 0.131464 0.112777 0.133250 0.112897
qa: -0.3146 -0.2724 -0.4604 -0.2602 -0.3025 -0.3038 -0.1519 -0.4027 -0.4080 0.0523 -0.0743 0.2808 -0.1840 0.1772 -0.2152 -0.1170 0.4337 -0.2598 0.3736 0.4319 0.4084 -0.3253 -0.1398 -0.1164 -0.1143 -0.1136 0.1547 0.1518 0.1646 0.1056 0.1220 0.1021 0.1430 0.1256 0.1315 0.1228 0.1253 0.1065 0.1074 0.1128 0.1124 0.1315 0.1128 0.1332 0.1129
va: 2.0851 2.1163 2.0338 1.9355 2.1159 2.1160 2.8487 2.9331 2.9097 3.7875 3.7944 3.6978 3.9287 3.7801 4.0149 3.8958 4.1550 3.9401 4.2742 3.9836 4.0328 3.9272 3.8574 3.8847 3.8514 3.8465 0.9948 1.0017 0.9879 1.0011 0.9949 1.0162 1.0170 0.9924 0.9942 0.9954 0.9942 0.9914 0.9935 0.9965 0.9950 0.9932 0.9956 0.9943 0.9938
dispcorr: -0.022400729 hartree
energy: -1274.955882029432
dipole: -9.36340 9.27714 -0.08627 3.81237 -4.81753 -1.00516 -5.70649 4.44669 -1.25979
magnitude: 1.61396 au
magnitude: 4.10236 debye
