program: Orca
programVersion: 5.0.2
elementType: O O O O O O N N N C C C C C C C C C C C C C C C C C H H H H H H H H H H H H H H H H H H H
charge: 0
multiplicity: 1
keywords: wb97x-d3
keywords: def2-TZVPP
keywords: def2/J RIJCOSX
keywords: DEFGRID2
keywords: scfconv7
keywords: smallprint printgap noloewdin
keywords: NOSOSCF
formula: C17H19N3O6
InChI: InChI=1/C17H19N3O6/c1-10(20-25-5)11-7-6-8-12(15(11)16(21)24-4)26-17-18-13(22-2)9-14(19-17)23-3/h6-9H,1-5H3
45 atoms
O  0.621398 -1.967583 -0.975389
O  -0.7725 1.604064 -0.089406
O  -0.436324 0.477948 -1.987663
O  -4.287705 2.01914 2.10387
O  4.4904 -0.46509 -2.745835
O  3.008786 1.177117 1.331025
N  -3.431203 0.954499 2.0715
N  2.532503 -1.248918 -1.852239
N  1.788248 -0.419869 0.232353
C  -2.323689 -0.639034 0.791632
C  -1.203059 -0.678165 -0.046621
C  -0.454405 -1.851365 -0.125587
C  -2.663559 -1.770454 1.527413
C  -3.18846 0.562026 0.882986
C  -0.790226 -2.96881 0.615928
C  -1.903076 -2.924559 1.438784
C  -0.76841 0.511567 -0.826992
C  -3.777498 1.167201 -0.352714
C  1.692378 -1.16173 -0.845769
C  3.592229 -0.453068 -1.774126
C  2.848485 0.380303 0.286724
C  3.809906 0.413363 -0.710711
C  -0.348521 2.821294 -0.708797
C  -4.480319 2.449206 3.438554
C  4.267194 -1.285601 -3.88973
C  2.01919 1.18179 2.356905
H  -3.543441 -1.751386 2.155206
H  -0.187433 -3.864056 0.541494
H  -2.179978 -3.797863 2.013467
H  -3.434687 0.664944 -1.254312
H  -3.5494 2.230393 -0.437651
H  -4.865335 1.074328 -0.328877
H  4.666849 1.069561 -0.666331
H  -0.982987 3.079188 -1.555998
H  0.689304 2.750028 -1.034631
H  -0.435172 3.587548 0.055059
H  -4.916935 1.664202 4.059801
H  -3.548007 2.789114 3.894819
H  -5.173582 3.286909 3.391277
H  3.343662 -1.019137 -4.403326
H  4.244175 -2.343756 -3.630737
H  5.10859 -1.099801 -4.551653
H  2.354001 1.917068 3.083339
H  1.043278 1.476609 1.973075
H  1.937963 0.210246 2.843825
elementType: O N C H
totalener: -1274.93352185 hartree
nucrepener: 2470.61028011 hartree
electener: -3745.54380197 hartree
oneelecener: -6653.27274350 hartree
twoeener: 2907.72894153 hartree
cpcmener: -0.04070347 hartree
kineticenergy: 1269.73975739 hartree
xcener: -119.061843157580 hartree
chargesum: 0.0000000
charge: -0.300193 -0.263343 -0.447758 -0.248541 -0.301632 -0.302548 -0.176369 -0.402544 -0.400831 0.082083 -0.014109 0.219009 -0.199006 0.153330 -0.184239 -0.122638 0.403075 -0.268562 0.362041 0.436022 0.409920 -0.324561 -0.135045 -0.109940 -0.115282 -0.111869 0.144824 0.152175 0.163997 0.103089 0.108656 0.122530 0.143013 0.130923 0.127303 0.132923 0.102334 0.103234 0.116055 0.114244 0.112653 0.131607 0.133255 0.105484 0.115228
qa: -0.3002 -0.2633 -0.4478 -0.2485 -0.3016 -0.3025 -0.1764 -0.4025 -0.4008 0.0821 -0.0141 0.2190 -0.1990 0.1533 -0.1842 -0.1226 0.4031 -0.2686 0.3620 0.4360 0.4099 -0.3246 -0.1350 -0.1099 -0.1153 -0.1119 0.1448 0.1522 0.1640 0.1031 0.1087 0.1225 0.1430 0.1309 0.1273 0.1329 0.1023 0.1032 0.1161 0.1142 0.1127 0.1316 0.1333 0.1055 0.1152
va: 2.0963 2.1162 2.0478 1.9376 2.1171 2.1103 2.8332 2.9475 2.9053 3.6553 3.5992 3.7439 3.9683 3.7500 4.0117 3.9184 4.0574 3.9563 4.3037 3.9856 4.0096 3.9342 3.8323 3.8929 3.8466 3.8447 1.0146 1.0007 0.9876 1.0113 1.0037 1.0012 1.0174 0.9945 0.9928 0.9926 0.9943 0.9942 0.9933 0.9965 0.9958 0.9934 0.9944 0.9946 0.9969
dispcorr: -0.023619096 hartree
energy: -1274.957140949948
dipole: -8.84392 8.34637 -0.49755 11.39668 -10.56830 0.82838 5.76368 -4.56870 1.19498
magnitude: 1.53680 au
magnitude: 3.90623 debye
