program: Orca
programVersion: 5.0.2
elementType: O O O O O O N N N C C C C C C C C C C C C C C C C C H H H H H H H H H H H H H H H H H H H
charge: 0
multiplicity: 1
keywords: wb97x-d3
keywords: def2-TZVPP
keywords: def2/J RIJCOSX
keywords: DEFGRID2
keywords: scfconv7
keywords: smallprint printgap noloewdin
keywords: NOSOSCF
formula: C17H19N3O6
InChI: InChI=1/C17H19N3O6/c1-10(20-25-5)11-7-6-8-12(15(11)16(21)24-4)26-17-18-13(22-2)9-14(19-17)23-3/h6-9H,1-5H3
45 atoms
O  0.962816 -1.610247 -1.048071
O  -0.771963 1.364622 0.535168
O  -0.199581 1.023661 -1.59897
O  -4.321739 1.95664 -0.593732
O  2.341249 0.509314 2.760433
O  4.915234 0.563805 -1.099887
N  -3.373489 0.987174 -0.692843
N  1.618193 -0.59888 0.890212
N  2.920035 -0.558371 -1.082725
C  -2.496062 -1.022715 0.060096
C  -1.184647 -0.751844 -0.349712
C  -0.303225 -1.812764 -0.54354
C  -2.875575 -2.340991 0.300425
C  -3.508698 0.04813 0.159448
C  -0.684027 -3.119765 -0.301623
C  -1.977175 -3.378894 0.121817
C  -0.688398 0.640339 -0.563164
C  -4.600655 -0.041111 1.175739
C  1.866706 -0.881948 -0.366085
C  2.525758 0.159879 1.497506
C  3.823234 0.184687 -0.455426
C  3.676596 0.599346 0.862157
C  -0.280855 2.705102 0.479911
C  -4.030279 3.014195 -1.491768
C  1.161738 0.075907 3.435654
C  5.076034 0.194301 -2.467455
H  -3.889059 -2.563291 0.606672
H  0.026149 -3.922647 -0.448779
H  -2.286921 -4.398212 0.307226
H  -5.531528 -0.386358 0.720645
H  -4.801379 0.931355 1.623908
H  -4.342429 -0.732147 1.974287
H  4.410779 1.217981 1.357783
H  -0.837488 3.301812 -0.243655
H  0.78094 2.728052 0.233593
H  -0.428235 3.116892 1.473717
H  -4.83501 3.737643 -1.379665
H  -3.080666 3.497594 -1.249008
H  -4.002948 2.670045 -2.527613
H  1.104136 -1.011182 3.49079
H  0.260992 0.462072 2.959549
H  1.235996 0.480865 4.44135
H  4.277189 0.596716 -3.090297
H  6.022376 0.628488 -2.778566
H  5.121352 -0.88737 -2.592015
elementType: O N C H
totalener: -1274.93274872 hartree
nucrepener: 2488.63939183 hartree
electener: -3763.57214054 hartree
oneelecener: -6689.89540192 hartree
twoeener: 2926.32326138 hartree
cpcmener: -0.04466880 hartree
kineticenergy: 1269.73945856 hartree
xcener: -119.064564837051 hartree
chargesum: 0.0000000
charge: -0.302966 -0.264726 -0.449554 -0.252229 -0.302872 -0.302304 -0.160845 -0.396525 -0.404082 0.002548 -0.010176 0.234873 -0.169623 0.190432 -0.187650 -0.132090 0.405430 -0.271994 0.359780 0.400472 0.436944 -0.320575 -0.132301 -0.111619 -0.113297 -0.114880 0.154185 0.152984 0.164266 0.123310 0.103402 0.103146 0.142601 0.128047 0.121380 0.131815 0.121830 0.101549 0.107050 0.115292 0.107723 0.133398 0.114074 0.131347 0.112428
qa: -0.3030 -0.2647 -0.4496 -0.2522 -0.3029 -0.3023 -0.1608 -0.3965 -0.4041 0.0025 -0.0102 0.2349 -0.1696 0.1904 -0.1876 -0.1321 0.4054 -0.2720 0.3598 0.4005 0.4369 -0.3206 -0.1323 -0.1116 -0.1133 -0.1149 0.1542 0.1530 0.1643 0.1233 0.1034 0.1031 0.1426 0.1280 0.1214 0.1318 0.1218 0.1015 0.1070 0.1153 0.1077 0.1334 0.1141 0.1313 0.1124
va: 2.0944 2.0978 2.0456 1.9370 2.1070 2.1176 2.8412 2.9069 2.9443 3.8182 3.6614 3.7098 3.9111 3.7270 4.0156 3.9119 4.1301 3.9479 4.3084 4.0134 3.9845 3.9278 3.8445 3.8927 3.8427 3.8475 0.9954 1.0000 0.9882 0.9946 1.0109 1.0030 1.0174 0.9935 0.9941 0.9919 0.9936 0.9842 0.9962 0.9964 0.9956 0.9940 0.9964 0.9935 0.9962
dispcorr: -0.023912922 hartree
energy: -1274.956661638955
dipole: -9.98941 8.95187 -1.03754 8.97395 -8.94020 0.03375 4.83266 -2.83122 2.00144
magnitude: 2.25464 au
magnitude: 5.73084 debye
