program: Orca
programVersion: 5.0.2
elementType: O O O O O O N N N C C C C C C C C C C C C C C C C C H H H H H H H H H H H H H H H H H H H
charge: 0
multiplicity: 1
keywords: wb97x-d3
keywords: def2-TZVPP
keywords: def2/J RIJCOSX
keywords: DEFGRID2
keywords: scfconv7
keywords: smallprint printgap noloewdin
keywords: NOSOSCF
formula: C17H19N3O6
InChI: InChI=1/C17H19N3O6/c1-10(20-25-5)11-7-6-8-12(15(11)16(21)24-4)26-17-18-13(22-2)9-14(19-17)23-3/h6-9H,1-5H3
45 atoms
O  1.182835 -1.126044 1.032562
O  -1.102003 1.95179 0.711067
O  -0.010643 1.025263 2.425724
O  -5.266608 1.414867 -0.087032
O  2.568772 -0.264099 -3.229381
O  5.507776 -0.054369 0.36113
N  -4.231091 0.578675 -0.38227
N  1.82399 -0.690457 -1.113205
N  3.318517 -0.604205 0.712048
C  -2.377391 -0.602185 0.369588
C  -1.058722 -0.364721 0.785699
C  -0.095006 -1.345898 0.580667
C  -2.679301 -1.80337 -0.262814
C  -3.471552 0.368006 0.617602
C  -0.401853 -2.540321 -0.047984
C  -1.699275 -2.761272 -0.472537
C  -0.657059 0.925169 1.41494
C  -3.690603 0.944623 1.982484
C  2.143308 -0.792612 0.154402
C  2.815948 -0.36811 -1.934981
C  4.295672 -0.27037 -0.120093
C  4.108784 -0.135383 -1.491059
C  -0.867006 3.261004 1.232699
C  -6.079619 1.600964 -1.228037
C  1.244994 -0.50963 -3.695003
C  5.719401 -0.165171 1.765155
H  -3.697688 -1.999759 -0.56911
H  0.367282 -3.286221 -0.199968
H  -1.951751 -3.691613 -0.963829
H  -3.683056 2.035595 1.975346
H  -2.950578 0.59637 2.699391
H  -4.668315 0.63783 2.361354
H  4.912795 0.131318 -2.161601
H  -1.361335 3.945722 0.54937
H  0.198653 3.488806 1.262799
H  -1.29055 3.377169 2.230504
H  -5.520881 2.035704 -2.060329
H  -6.540125 0.665955 -1.557146
H  -6.865932 2.29422 -0.932743
H  0.525736 0.184451 -3.259508
H  0.925549 -1.531585 -3.48733
H  1.279492 -0.359104 -4.771132
H  5.521298 -1.174669 2.126367
H  6.76899 0.070402 1.922822
H  5.105988 0.541995 2.324123
elementType: O N C H
totalener: -1274.93668867 hartree
nucrepener: 2403.57970454 hartree
electener: -3678.51639320 hartree
oneelecener: -6518.92081191 hartree
twoeener: 2840.40441871 hartree
cpcmener: -0.03551070 hartree
kineticenergy: 1269.75933164 hartree
xcener: -119.060969970197 hartree
chargesum: 0.0000000
charge: -0.296771 -0.261945 -0.421098 -0.237092 -0.295317 -0.295140 -0.171004 -0.420019 -0.404363 0.073725 -0.039347 0.261945 -0.201974 0.172453 -0.183219 -0.115414 0.354833 -0.271190 0.400158 0.396257 0.423115 -0.321044 -0.133438 -0.110991 -0.112987 -0.114220 0.141409 0.147865 0.160645 0.106903 0.104571 0.120508 0.140862 0.131166 0.127583 0.119154 0.101937 0.101525 0.113391 0.111857 0.110962 0.130555 0.111804 0.128756 0.112635
qa: -0.2968 -0.2619 -0.4211 -0.2371 -0.2953 -0.2951 -0.1710 -0.4200 -0.4044 0.0737 -0.0393 0.2619 -0.2020 0.1725 -0.1832 -0.1154 0.3548 -0.2712 0.4002 0.3963 0.4231 -0.3210 -0.1334 -0.1110 -0.1130 -0.1142 0.1414 0.1479 0.1606 0.1069 0.1046 0.1205 0.1409 0.1312 0.1276 0.1192 0.1019 0.1015 0.1134 0.1119 0.1110 0.1306 0.1118 0.1288 0.1126
va: 2.1116 2.1288 2.0781 1.9488 2.1250 2.1240 2.8518 2.9097 2.9537 3.6793 3.6957 3.7164 3.9882 3.7248 4.0040 3.9101 4.2220 3.9550 4.2432 4.0524 4.0009 3.9182 3.8509 3.8982 3.8531 3.8509 1.0178 1.0013 0.9889 1.0038 1.0107 1.0029 1.0173 0.9934 0.9944 0.9920 0.9951 0.9933 0.9939 0.9956 0.9933 0.9945 0.9967 0.9934 0.9968
dispcorr: -0.021214809 hartree
energy: -1274.957903475113
dipole: -12.71272 11.77370 -0.93903 7.98673 -7.75759 0.22914 -2.42734 1.34209 -1.08525
magnitude: 1.45328 au
magnitude: 3.69395 debye
