program: Orca
programVersion: 5.0.2
elementType: O O O O O O N N N C C C C C C C C C C C C C C C C C H H H H H H H H H H H H H H H H H H H
charge: 0
multiplicity: 1
keywords: wb97x-d3
keywords: def2-TZVPP
keywords: def2/J RIJCOSX
keywords: DEFGRID2
keywords: scfconv7
keywords: smallprint printgap noloewdin
keywords: NOSOSCF
formula: C17H19N3O6
InChI: InChI=1/C17H19N3O6/c1-10(20-25-5)11-7-6-8-12(15(11)16(21)24-4)26-17-18-13(22-2)9-14(19-17)23-3/h6-9H,1-5H3
45 atoms
O  0.94564 -1.902499 0.325724
O  0.623915 0.292227 1.882548
O  -0.707813 1.725184 0.811143
O  -4.858149 2.094432 0.492454
O  5.239248 -0.616111 -0.130149
O  1.892518 1.512064 -2.546795
N  -4.071765 1.098546 -0.00964
N  3.065942 -1.276784 0.11034
N  1.369365 -0.198557 -1.127616
C  -2.48144 -0.547139 0.385269
C  -1.092139 -0.60259 0.563361
C  -0.404368 -1.742152 0.141157
C  -3.141093 -1.616449 -0.210658
C  -3.292325 0.600957 0.863972
C  -1.066962 -2.799412 -0.456375
C  -2.438223 -2.734359 -0.627985
C  -0.382168 0.596595 1.086329
C  -3.251378 1.006444 2.305205
C  1.8231 -1.077403 -0.266099
C  3.964828 -0.479358 -0.452275
C  2.27997 0.599027 -1.675289
C  3.630337 0.507618 -1.371995
C  1.459635 1.359738 2.334611
C  -5.685232 2.616028 -0.528088
C  5.604668 -1.610504 0.821754
C  0.50436 1.626372 -2.851579
H  -4.215421 -1.579497 -0.328573
H  -0.505182 -3.665594 -0.781215
H  -2.961451 -3.560995 -1.089769
H  -2.501422 0.449874 2.863053
H  -4.217572 0.799763 2.771918
H  -3.057677 2.0718 2.429785
H  4.369823 1.156612 -1.818444
H  1.85437 1.940153 1.500321
H  2.281767 0.887887 2.865199
H  0.921289 2.019688 3.015266
H  -6.284167 3.399573 -0.066308
H  -5.101784 3.052496 -1.342549
H  -6.355017 1.855853 -0.938054
H  6.684064 -1.533329 0.926299
H  5.349547 -2.613333 0.478399
H  5.137378 -1.433972 1.791065
H  -0.084142 1.87844 -1.969363
H  0.429355 2.435335 -3.573943
H  0.111098 0.711841 -3.296179
elementType: O N C H
totalener: -1274.93713012 hartree
nucrepener: 2466.56607753 hartree
electener: -3741.50320765 hartree
oneelecener: -6645.00137522 hartree
twoeener: 2903.49816756 hartree
cpcmener: -0.03211643 hartree
kineticenergy: 1269.76490470 hartree
xcener: -119.065403502973 hartree
chargesum: -0.0000000
charge: -0.290697 -0.270708 -0.431939 -0.238675 -0.293559 -0.292964 -0.173977 -0.395318 -0.401989 0.111782 -0.014295 0.216315 -0.197352 0.145664 -0.182269 -0.119504 0.385628 -0.272931 0.352970 0.428997 0.410262 -0.322483 -0.139295 -0.110807 -0.115462 -0.113514 0.142701 0.149381 0.159634 0.100070 0.120129 0.109324 0.140317 0.118308 0.130391 0.134322 0.113209 0.101773 0.100444 0.129338 0.112446 0.111617 0.109676 0.131197 0.111841
qa: -0.2907 -0.2707 -0.4319 -0.2387 -0.2936 -0.2930 -0.1740 -0.3953 -0.4020 0.1118 -0.0143 0.2163 -0.1974 0.1457 -0.1823 -0.1195 0.3856 -0.2729 0.3530 0.4290 0.4103 -0.3225 -0.1393 -0.1108 -0.1155 -0.1135 0.1427 0.1494 0.1596 0.1001 0.1201 0.1093 0.1403 0.1183 0.1304 0.1343 0.1132 0.1018 0.1004 0.1293 0.1124 0.1116 0.1097 0.1312 0.1118
va: 2.1074 2.1421 2.0513 1.9468 2.1272 2.1280 2.8412 2.9286 2.8986 3.6123 3.6192 3.7972 3.9646 3.7581 4.0162 3.9258 4.0879 3.9510 4.3111 3.9842 4.0230 3.9211 3.8590 3.8994 3.8533 3.8452 1.0152 1.0016 0.9892 1.0088 1.0018 1.0065 1.0180 0.9921 0.9945 0.9930 0.9938 0.9947 0.9940 0.9936 0.9966 0.9960 1.0016 0.9947 0.9964
dispcorr: -0.023377773 hartree
energy: -1274.960507893524
dipole: -7.56243 7.80963 0.24721 7.74862 -8.23869 -0.49007 3.07358 -2.71459 0.35900
magnitude: 0.65586 au
magnitude: 1.66707 debye
