program: Orca
programVersion: 5.0.2
elementType: O O O O O O N N N C C C C C C C C C C C C C C C C C H H H H H H H H H H H H H H H H H H H
charge: 0
multiplicity: 1
keywords: wb97x-d3
keywords: def2-TZVPP
keywords: def2/J RIJCOSX
keywords: DEFGRID2
keywords: scfconv7
keywords: smallprint printgap noloewdin
keywords: NOSOSCF
formula: C17H19N3O6
InChI: InChI=1/C17H19N3O6/c1-10(20-25-5)11-7-6-8-12(15(11)16(21)24-4)26-17-18-13(22-2)9-14(19-17)23-3/h6-9H,1-5H3
45 atoms
O  1.031714 -0.876355 1.045507
O  0.19241 1.707864 0.485852
O  -1.475823 1.692795 1.972322
O  -5.658808 1.06941 0.49061
O  2.706072 -0.693042 -3.194326
O  5.365623 0.235529 0.497388
N  -4.671176 0.138424 0.600256
N  1.817667 -0.782017 -1.09344
N  3.167605 -0.318719 0.786922
C  -2.487667 -0.49056 0.14356
C  -1.181435 -0.179402 0.541497
C  -0.212896 -1.174968 0.54238
C  -2.775491 -1.791707 -0.256167
C  -3.563174 0.529248 0.108969
C  -0.507181 -2.47145 0.160947
C  -1.795854 -2.772577 -0.241975
C  -0.849573 1.167653 1.086942
C  -3.350072 1.857552 -0.549633
C  2.043606 -0.64977 0.191613
C  2.859398 -0.566211 -1.887697
C  4.197174 -0.101522 -0.020907
C  4.110298 -0.214601 -1.403228
C  0.66043 2.966809 0.976086
C  -6.862032 0.559151 1.031083
C  1.429057 -1.074117 -3.698232
C  5.476949 0.369972 1.910478
H  -3.774681 -2.035739 -0.590054
H  0.261003 -3.233315 0.188073
H  -2.039003 -3.780112 -0.551937
H  -4.061342 1.983614 -1.368755
H  -2.353597 1.94803 -0.976239
H  -3.508626 2.687232 0.140244
H  4.956397 -0.042574 -2.052655
H  -0.099071 3.741431 0.870851
H  1.52151 3.220794 0.364598
H  0.967283 2.894811 2.019492
H  -7.212035 -0.319927 0.483983
H  -6.756535 0.302443 2.087924
H  -7.602271 1.351645 0.933594
H  0.6586 -0.346219 -3.44273
H  1.126824 -2.0566 -3.334072
H  1.539985 -1.113197 -4.779035
H  6.511344 0.647459 2.097922
H  4.821737 1.151981 2.295485
H  5.259262 -0.565739 2.426063
elementType: O N C H
totalener: -1274.93762597 hartree
nucrepener: 2410.86496532 hartree
electener: -3685.80259129 hartree
oneelecener: -6533.29259941 hartree
twoeener: 2847.49000812 hartree
cpcmener: -0.03360544 hartree
kineticenergy: 1269.76721799 hartree
xcener: -119.062170913793 hartree
chargesum: -0.0000000
charge: -0.306619 -0.269801 -0.423022 -0.235968 -0.295264 -0.294490 -0.168400 -0.411609 -0.402183 0.111443 -0.059992 0.282909 -0.206861 0.152289 -0.208695 -0.107982 0.382693 -0.270428 0.385834 0.396709 0.425119 -0.321813 -0.135361 -0.111413 -0.113044 -0.115427 0.141054 0.148548 0.160080 0.116530 0.099155 0.115024 0.140834 0.125752 0.125478 0.124141 0.102030 0.102936 0.113562 0.111694 0.110704 0.130785 0.129005 0.112346 0.111717
qa: -0.3066 -0.2698 -0.4230 -0.2360 -0.2953 -0.2945 -0.1684 -0.4116 -0.4022 0.1114 -0.0600 0.2829 -0.2069 0.1523 -0.2087 -0.1080 0.3827 -0.2704 0.3858 0.3967 0.4251 -0.3218 -0.1354 -0.1114 -0.1130 -0.1154 0.1411 0.1485 0.1601 0.1165 0.0992 0.1150 0.1408 0.1258 0.1255 0.1241 0.1020 0.1029 0.1136 0.1117 0.1107 0.1308 0.1290 0.1123 0.1117
va: 2.0948 2.1329 2.0835 1.9531 2.1254 2.1244 2.8557 2.8979 2.9351 3.6488 3.7553 3.7198 3.9827 3.7365 4.0201 3.9056 4.1576 3.9497 4.2492 4.0502 3.9934 3.9204 3.8629 3.8968 3.8542 3.8539 1.0187 1.0019 0.9889 1.0036 1.0115 1.0051 1.0175 0.9929 0.9949 0.9923 0.9932 0.9953 0.9939 0.9955 0.9939 0.9944 0.9936 0.9960 0.9970
dispcorr: -0.021663700 hartree
energy: -1274.959289674703
dipole: -8.91556 9.47848 0.56291 6.34209 -6.41035 -0.06826 -3.23098 1.72290 -1.50808
magnitude: 1.61116 au
magnitude: 4.09524 debye
