program: Gaussian 09
title: 000073916
version: EM64L-G09RevD.01
frameworkgroup: C1[X(C6H9ClO3)]
method: RPBEPBE
basis: SDD
operation: Freq
keyword: #p
keyword: freq=noraman
keyword: PBEPBE/SDD
title: #p freq=noraman PBEPBE/SDD
converged: NO YES NO NO
title: Mulliken charges:
elementType: Cl O O O C C C C C C H H H H H H H H H
charge: -0.101783 -0.264810 -0.229683 -0.083842 -0.370560 -0.489436 -0.379773 0.236098 -0.042982 -0.504169 0.242545 0.242274 0.246708 0.247013 0.264672 0.264550 0.235963 0.243613 0.243602
chargesum: 0.00000
title: Mulliken charges with hydrogens summed into heavy atoms:
elementType: Cl O O O C C C C C C
charge: -0.101783 -0.264810 -0.229683 -0.083842 0.114259 0.004285 0.149449 0.236098 -0.042982 0.219009
polarizability: 1.16439125e+02 6.61332178e+00 8.15167592e+01 -6.21959094e-02 -1.44492324e-02 5.20432789e+01
1716.lowfreq: -13.3463 -0.0023 -0.0014 0.0008 4.1362 7.1307 14.5335 36.3798 66.1120
frequency: -6.8579 36.3703 66.1101 78.6452 96.6713 104.5311 167.6845 176.0558 207.4458 286.7484 366.6011 390.2249 443.2353 462.9674 550.0436 655.2563 712.3091 729.3635 833.3551 839.2126 946.5035 958.8366 1058.0605 1059.2901 1075.5673 1114.8049 1141.7616 1144.1767 1150.2559 1252.0135 1252.2231 1285.3764 1327.9296 1371.0525 1424.8985 1426.1970 1443.8437 1455.1272 1464.1951 1473.7198 1652.2571 1761.9129 2992.8179 2993.8003 3006.0159 3025.5918 3037.6145 3043.4788 3089.6288 3108.6665 3149.7374
redmass: 8.8588 3.7211 6.1925 1.9961 1.7477 1.3343 6.7789 2.9668 9.5618 4.2078 5.6110 14.5487 4.6030 2.8535 2.6639 5.1890 7.0475 1.2415 6.3670 1.5840 6.4297 4.2897 1.9464 3.1690 3.1445 1.2652 3.5230 1.1994 1.4452 1.2017 1.4121 1.0659 1.6242 1.6897 1.1810 1.0894 1.0799 1.0495 1.0506 1.0867 9.1117 11.0269 1.0607 1.0611 1.0296 1.0605 1.0979 1.0997 1.1034 1.1047 1.1049
irintensity: 0.1191 1.4958 0.2545 0.0280 4.6381 0.6263 3.0386 10.5484 3.9807 23.1549 31.4504 12.6963 25.4059 0.0008 1.4282 13.6621 115.5849 16.4924 22.7107 0.3347 23.3783 83.3655 2.3828 71.5912 32.1890 0.0199 218.5952 2.6345 11.4409 1.8800 118.9616 0.1790 7.0784 21.5991 20.1853 23.8510 29.4765 14.9131 11.3409 17.1870 165.1287 244.0254 11.0977 5.6267 30.3472 9.0270 3.1923 1.2301 23.0044 26.9350 15.3550
temp: 298.150 k
press: 1.00000 atm
elementType: 17 8 8 8 6 6 6 6 6 6 1 1 1 1 1 1 1 1 1
symmnumber: 1
zpe: 376166.9 jmol-1
zpe.correction: 0.143274 hartree
zpe.thermalcorrener: 0.154426 hartree
zpe.thermalcorrenthalpy: 0.155370 hartree
zpe.thermalcorrgfe: 0.104223 hartree
zpe.sumelectzpe: -918.988553 hartree
zpe.sumelectthermal: -918.977402 hartree
zpe.sumelectthermalent: -918.976458 hartree
zpe.sumelectthermalfe: -919.027605 hartree
dipole: 3.9113 -3.0623 -0.0007
dipole: 4.9675
quadrupole: -69.4808 -74.0353 -63.0069
quadrupole: -0.2547 -0.0462 -0.0082
quadrupole: -0.6398 -5.1943 5.8341 -0.2547 -0.0462 -0.0082
hfenergy: -919.1318279 hartree
pointgroup: C01 [X(C6H9Cl1O3)]
dipole: -1.6007437 -1.1212493 0.0025185 debye
dipolederiv: -0.9677125 0.3881588 0.007126 0.4726846 -0.514665 -0.0051526 0.0085222 -0.0051686 -0.1660275 -1.4928843 -0.2280742 0.0091508 -0.3609912 -0.6030467 0.0014418 0.0111979 0.0013433 -0.2990308 -0.6846135 0.1115559 0.0033145 -0.238903 -0.9027648 0.000587 0.0013295 -0.0056284 -0.2948842 -0.5532684 -0.0358977 0.001523 0.3115345 -1.0919149 -0.0089496 0.0036899 -0.005824 -0.1938229 0.0476974 0.005274 0.0005821 -0.0825329 0.0375043 -0.0005628 -0.00095 -0.0006238 0.1425043 -0.2596951 0.1094505 0.0039532 0.3067129 -0.1000813 -0.0036529 0.0043278 -0.0022133 0.1548308 -0.2423687 -0.0800403 0.0012235 -0.1649396 -0.1689231 -0.0017538 -0.0005999 -0.0025516 0.1341197 1.6338649 0.0985054 -0.0116775 0.4779342 1.2429737 -0.0003279 -0.0110597 0.0045383 0.1831215 1.6222905 -0.2988954 -0.0098609 -0.7169274 1.5842674 0.0153717 -0.0124179 0.0125854 0.1359953 0.6325637 0.0039882 -0.0037595 -0.1153736 0.2173836 0.000904 -0.0038272 -0.0001566 0.2766076 0.0657336 -0.0069594 0.0024003 -0.0001811 0.0190168 0.0865551 0.0023476 0.0807444 -0.0349077 0.0651738 -0.0074063 -0.0034432 -0.0008939 0.0219476 -0.0856113 -0.0031154 -0.0798286 -0.0383139 0.0482591 0.0112531 0.0013793 -0.0325976 0.0355594 -0.0837075 -0.0055871 -0.1039817 -0.0193125 0.0476216 0.0121348 -0.001585 -0.0323829 0.0322702 0.0847079 0.0042877 0.1047069 -0.0152679 0.0369755 -0.0004585 0.0097375 0.0560251 0.0642405 -0.0713481 0.0212167 -0.0853844 0.01028 0.0370926 0.0005984 -0.0100116 0.0570718 0.0613832 0.0717991 -0.0201886 0.0864198 0.0131131 -0.0389786 -0.076013 0.001069 -0.1229516 -0.0191972 0.0003084 0.0009566 -0.0001419 0.1226783 0.0011319 -0.0027735 0.0165647 0.0946597 0.0408999 0.0994878 -0.038011 0.0879925 -0.0544223 0.0011167 -0.0044006 -0.0176862 0.0920521 0.0431462 -0.1000963 0.0378807 -0.0868277 -0.0572609 unknown
polarizability: 115.6343809|-8.4284768|82.316434|-0.4913773|0.2624073|52.0483484 unknown
InChI: InChI=1S/C6H9ClO3/c1-10-6(9)4-2-3-5(7)8/h2-4H2,1H3
charge 0 multiplicity 1
19 atoms
Cl 4.548319 -0.990639 -0.041246
O  -3.185373 -0.763796 0.006459
O  -2.189912 1.342557 0.00893
O  3.159157 1.377022 -0.016132
C  0.45683 0.196439 -0.011038
C  -0.791473 -0.70687 -0.014218
C  1.740481 -0.659101 -0.024475
C  -2.085065 0.096519 -0.001713
C  3.008725 0.164192 -0.023264
C  -4.516947 -0.108644 0.02372
H  0.436807 0.869544 -0.886224
H  0.444392 0.852983 0.876844
H  -0.808813 -1.365771 -0.904084
H  -0.801492 -1.382789 0.862883
H  1.782608 -1.32136 -0.911588
H  1.790702 -1.336562 0.850655
H  -5.238557 -0.937448 0.02581
H  -4.641882 0.525161 -0.870072
H  -4.624006 0.513962 0.927652
