program: Orca
programVersion: 5.0.2
elementType: O O O O O O N N N C C C C C C C C C C C C C C C C C H H H H H H H H H H H H H H H H H H H
charge: 0
multiplicity: 1
keywords: wb97x-d3
keywords: def2-TZVPP
keywords: def2/J RIJCOSX
keywords: DEFGRID2
keywords: scfconv7
keywords: smallprint printgap noloewdin
keywords: NOSOSCF
formula: C17H19N3O6
InChI: InChI=1/C17H19N3O6/c1-10(20-25-5)11-7-6-8-12(15(11)16(21)24-4)26-17-18-13(22-2)9-14(19-17)23-3/h6-9H,1-5H3
45 atoms
O  1.139266 -0.703371 1.285884
O  0.334647 1.669662 0.243146
O  -1.547642 2.072141 1.372422
O  -5.556502 1.064528 0.151773
O  5.328594 0.548191 0.173965
O  2.432776 -1.070695 -3.073361
N  -4.579969 0.213798 0.577773
N  3.207849 -0.080014 0.7522
N  1.744179 -0.915294 -0.901301
C  -2.402699 -0.557809 0.353436
C  -1.097527 -0.139485 0.648365
C  -0.126119 -1.098077 0.920678
C  -2.696511 -1.916917 0.35509
C  -3.470558 0.402431 -0.016089
C  -0.426383 -2.448127 0.933476
C  -1.719102 -2.853165 0.653792
C  -0.80653 1.313389 0.798664
C  -3.246257 1.414346 -1.09773
C  2.064037 -0.562724 0.321124
C  4.145983 0.070233 -0.174007
C  2.690334 -0.749297 -1.816982
C  3.946897 -0.248362 -1.511814
C  0.754788 3.027241 0.39719
C  -6.780671 0.746253 0.783246
C  5.555655 0.897215 1.535219
C  1.136067 -1.55963 -3.401066
H  -3.697088 -2.243367 0.10644
H  0.346174 -3.168919 1.167679
H  -1.964635 -3.906741 0.657271
H  -3.451564 2.430831 -0.761543
H  -3.918264 1.211548 -1.934812
H  -2.231155 1.376772 -1.486963
H  4.715238 -0.114636 -2.259503
H  1.73941 3.084494 -0.057878
H  0.825738 3.306536 1.448072
H  0.077889 3.709379 -0.11702
H  -6.715215 0.835604 1.870358
H  -7.511264 1.464586 0.414362
H  -7.118854 -0.261532 0.528599
H  4.881712 1.68701 1.86867
H  6.579228 1.261364 1.577687
H  5.454256 0.036752 2.197119
H  0.35924 -0.826707 -3.179889
H  1.154756 -1.747667 -4.471761
H  0.908225 -2.489295 -2.87867
elementType: O N C H
totalener: -1274.93694401 hartree
nucrepener: 2427.63397301 hartree
electener: -3702.57091701 hartree
oneelecener: -6566.83850810 hartree
twoeener: 2864.26759109 hartree
cpcmener: -0.03366815 hartree
kineticenergy: 1269.77336132 hartree
xcener: -119.064439313052 hartree
chargesum: -0.0000000
charge: -0.307214 -0.265321 -0.427516 -0.236949 -0.294894 -0.295904 -0.171031 -0.398339 -0.408413 0.110090 -0.061621 0.265526 -0.203685 0.158063 -0.196404 -0.111964 0.394689 -0.271815 0.381100 0.427588 0.397380 -0.323988 -0.127201 -0.109543 -0.114711 -0.113631 0.141291 0.149738 0.160587 0.112064 0.118878 0.096848 0.140008 0.119475 0.121214 0.125536 0.101957 0.112993 0.100813 0.111152 0.128886 0.111896 0.110791 0.130566 0.111017
qa: -0.3072 -0.2653 -0.4275 -0.2369 -0.2949 -0.2959 -0.1710 -0.3983 -0.4084 0.1101 -0.0616 0.2655 -0.2037 0.1581 -0.1964 -0.1120 0.3947 -0.2718 0.3811 0.4276 0.3974 -0.3240 -0.1272 -0.1095 -0.1147 -0.1136 0.1413 0.1497 0.1606 0.1121 0.1189 0.0968 0.1400 0.1195 0.1212 0.1255 0.1020 0.1130 0.1008 0.1112 0.1289 0.1119 0.1108 0.1306 0.1110
va: 2.0929 2.1408 2.0799 1.9499 2.1232 2.1242 2.8503 2.9269 2.8887 3.6459 3.7166 3.7421 3.9731 3.7412 4.0263 3.9126 4.1441 3.9539 4.2621 3.9837 4.0478 3.9221 3.8694 3.8975 3.8548 3.8584 1.0180 1.0002 0.9888 1.0058 1.0027 1.0098 1.0178 0.9952 0.9931 0.9915 0.9954 0.9940 0.9935 0.9961 0.9936 0.9968 0.9939 0.9946 0.9941
dispcorr: -0.022078467 hartree
energy: -1274.959022472579
dipole: -8.93595 9.53085 0.59490 5.30434 -5.75425 -0.44991 -4.94396 3.58780 -1.35616
magnitude: 1.54774 au
magnitude: 3.93405 debye
