program: Orca
programVersion: 5.0.2
elementType: O O O O O O N N N C C C C C C C C C C C C C C C C C H H H H H H H H H H H H H H H H H H H
charge: 0
multiplicity: 1
keywords: wb97x-d3
keywords: def2-TZVPP
keywords: def2/J RIJCOSX
keywords: DEFGRID2
keywords: scfconv7
keywords: smallprint printgap noloewdin
keywords: NOSOSCF
formula: C17H19N3O6
InChI: InChI=1/C17H19N3O6/c1-10(20-25-5)11-7-6-8-12(15(11)16(21)24-4)26-17-18-13(22-2)9-14(19-17)23-3/h6-9H,1-5H3
45 atoms
O  0.8920 0.831015 -1.067189
O  -0.980835 2.261949 0.744314
O  -0.749589 0.340481 1.867338
O  -4.720549 0.917193 1.813614
O  2.830967 -3.206378 -0.184259
O  5.233015 0.75425 0.140872
N  -3.660474 0.813052 0.975247
N  1.812576 -1.210764 -0.626795
N  3.033265 0.80384 -0.474476
C  -2.553272 -0.310708 -0.724081
C  -1.317394 0.285707 -0.444053
C  -0.293252 0.201403 -1.371132
C  -2.709742 -0.979644 -1.934754
C  -3.691944 -0.205577 0.211425
C  -0.453287 -0.45518 -2.579368
C  -1.673347 -1.045457 -2.854072
C  -1.010456 0.949917 0.862062
C  -4.777369 -1.233028 0.183046
C  1.955423 0.089661 -0.708154
C  2.898753 -1.889985 -0.275578
C  4.106932 0.111901 -0.116877
C  4.109296 -1.272743 0.000506
C  -0.670872 3.019668 1.914588
C  -4.558599 2.041984 2.658292
C  1.59687 -3.850485 -0.487573
C  5.259927 2.172513 0.020162
H  -3.657563 -1.439584 -2.179973
H  0.362733 -0.50435 -3.288569
H  -1.820934 -1.561482 -3.79321
H  -5.244676 -1.351407 1.158536
H  -4.390447 -2.202496 -0.124454
H  -5.562155 -0.949822 -0.522411
H  4.991158 -1.82764 0.286913
H  -0.687973 4.061789 1.607031
H  0.319119 2.774807 2.300811
H  -1.415363 2.863865 2.696253
H  -5.473677 2.118076 3.243749
H  -3.713554 1.917255 3.339732
H  -4.429681 2.962866 2.08538
H  1.781616 -4.913672 -0.356658
H  1.285913 -3.664906 -1.516169
H  0.800384 -3.538299 0.188081
H  5.036363 2.497628 -0.996348
H  4.56466 2.650927 0.710396
H  6.274673 2.469254 0.273565
elementType: O N C H
totalener: -1274.93764490 hartree
nucrepener: 2423.33876084 hartree
electener: -3698.27640574 hartree
oneelecener: -6559.20192441 hartree
twoeener: 2860.92551867 hartree
cpcmener: -0.03564260 hartree
kineticenergy: 1269.78510944 hartree
xcener: -119.070093542791 hartree
chargesum: -0.0000000
charge: -0.302803 -0.264468 -0.433141 -0.249890 -0.294955 -0.294628 -0.141902 -0.412309 -0.406078 0.057512 -0.067721 0.268060 -0.185614 0.175210 -0.207271 -0.120344 0.401257 -0.265005 0.394446 0.395911 0.420522 -0.317162 -0.138755 -0.120043 -0.113385 -0.115096 0.151666 0.149401 0.160235 0.104081 0.103962 0.119788 0.140643 0.129372 0.121883 0.113757 0.123016 0.106748 0.105924 0.130452 0.110096 0.113429 0.111824 0.112527 0.128850
qa: -0.3028 -0.2645 -0.4331 -0.2499 -0.2950 -0.2946 -0.1419 -0.4123 -0.4061 0.0575 -0.0677 0.2681 -0.1856 0.1752 -0.2073 -0.1203 0.4013 -0.2650 0.3944 0.3959 0.4205 -0.3172 -0.1388 -0.1200 -0.1134 -0.1151 0.1517 0.1494 0.1602 0.1041 0.1040 0.1198 0.1406 0.1294 0.1219 0.1138 0.1230 0.1067 0.1059 0.1305 0.1101 0.1134 0.1118 0.1125 0.1288
va: 2.0995 2.1210 2.0646 1.9483 2.1262 2.1241 2.8608 2.9180 2.9484 3.7773 3.7920 3.7183 3.9318 3.7861 4.0261 3.9065 4.2188 3.9433 4.2510 4.0522 4.0042 3.9198 3.8767 3.8926 3.8528 3.8524 0.9958 1.0009 0.9897 1.0164 1.0009 0.9950 1.0173 0.9949 0.9947 0.9902 0.9945 0.9894 0.9936 0.9944 0.9937 0.9956 0.9966 0.9963 0.9934
dispcorr: -0.021555311 hartree
energy: -1274.959200209761
dipole: -10.26619 9.56159 -0.70459 1.75194 -1.88966 -0.13772 5.41002 -6.20409 -0.79407
magnitude: 1.07050 au
magnitude: 2.72100 debye
