program: Orca
programVersion: 5.0.2
elementType: O O O O O O N N N C C C C C C C C C C C C C C C C C H H H H H H H H H H H H H H H H H H H
charge: 0
multiplicity: 1
keywords: wb97x-d3
keywords: def2-TZVPP
keywords: def2/J RIJCOSX
keywords: DEFGRID2
keywords: scfconv7
keywords: smallprint printgap noloewdin
keywords: NOSOSCF
formula: C17H19N3O6
InChI: InChI=1/C17H19N3O6/c1-10(20-25-5)11-7-6-8-12(15(11)16(21)24-4)26-17-18-13(22-2)9-14(19-17)23-3/h6-9H,1-5H3
45 atoms
O  1.421602 0.58774 1.101927
O  -1.87711 2.127724 -0.041678
O  -0.102822 1.345863 -1.152229
O  -5.53616 0.091252 0.632649
O  5.089368 1.267844 -1.426455
O  2.699559 -2.707783 -1.773252
N  -4.354859 -0.074897 1.289076
N  3.234131 0.935263 -0.143847
N  2.019866 -1.079194 -0.328802
C  -2.071409 -0.485131 1.15309
C  -0.899561 0.181502 0.774531
C  0.299126 -0.136607 1.402501
C  -2.006266 -1.446993 2.155073
C  -3.374004 -0.228987 0.494594
C  0.355922 -1.090283 2.402499
C  -0.804649 -1.742185 2.777485
C  -0.892665 1.259944 -0.253471
C  -3.496502 -0.263267 -1.00018
C  2.251498 0.118288 0.157281
C  4.077132 0.494857 -1.063974
C  2.875887 -1.505473 -1.245976
C  3.955735 -0.748364 -1.67374
C  -2.001501 3.193923 -0.972858
C  -6.568743 0.308364 1.565104
C  5.207117 2.541436 -0.814355
C  1.586203 -3.468986 -1.335298
H  -2.909882 -1.966555 2.440764
H  1.300945 -1.306473 2.881881
H  -0.77218 -2.491334 3.557152
H  -2.536975 -0.427485 -1.48508
H  -3.938277 0.65331 -1.390814
H  -4.157433 -1.079587 -1.297505
H  4.649929 -1.097183 -2.422331
H  -2.859785 3.774805 -0.647007
H  -2.171714 2.826213 -1.9856
H  -1.112843 3.825402 -0.976435
H  -6.396158 1.207559 2.161262
H  -7.481532 0.436414 0.985925
H  -6.692546 -0.541296 2.241283
H  5.355283 2.461681 0.263041
H  4.328212 3.160793 -0.994532
H  6.07971 3.004915 -1.26786
H  0.642384 -2.961754 -1.537332
H  1.627698 -4.399307 -1.896254
H  1.6354 -3.684961 -0.267437
totalener: -1274.91787575 hartree
nucrepener: 2413.99308304 hartree
electener: -3688.91095878 hartree
oneelecener: -6538.72098059 hartree
twoeener: 2849.81002181 hartree
kineticenergy: 1269.84427235 hartree
xcener: -119.071971573692 hartree
chargesum: -0.0000000
charge: -0.281072 -0.251345 -0.350624 -0.207766 -0.270138 -0.270731 -0.140667 -0.356736 -0.388546 0.093332 -0.084765 0.299250 -0.178117 0.160253 -0.178834 -0.090115 0.337786 -0.282611 0.363773 0.399626 0.372596 -0.301745 -0.144397 -0.111662 -0.119798 -0.116733 0.119670 0.119934 0.127784 0.099796 0.098666 0.114678 0.120516 0.122986 0.107639 0.121099 0.096549 0.101117 0.092835 0.105654 0.108856 0.115977 0.105204 0.119272 0.101548
qa: -0.2811 -0.2513 -0.3506 -0.2078 -0.2701 -0.2707 -0.1407 -0.3567 -0.3885 0.0933 -0.0848 0.2993 -0.1781 0.1603 -0.1788 -0.0901 0.3378 -0.2826 0.3638 0.3996 0.3726 -0.3017 -0.1444 -0.1117 -0.1198 -0.1167 0.1197 0.1199 0.1278 0.0998 0.0987 0.1147 0.1205 0.1230 0.1076 0.1211 0.0965 0.1011 0.0928 0.1057 0.1089 0.1160 0.1052 0.1193 0.1015
va: 2.1360 2.1317 2.1410 1.9705 2.1376 2.1400 2.8540 2.9627 2.9176 3.7148 3.7902 3.7855 4.0180 3.7293 4.0656 3.9361 4.1521 3.9603 4.2841 4.0205 4.0841 3.9270 3.8893 3.9268 3.8803 3.8893 1.0263 1.0105 0.9993 1.0098 1.0065 1.0051 1.0237 0.9924 0.9940 0.9966 0.9967 0.9950 0.9962 0.9990 0.9993 0.9928 0.9963 0.9941 0.9960
dispcorr: -0.021510997 hartree
energy: -1274.939386745997
dipole: -14.72845 13.84279 -0.88566 1.07530 -1.23142 -0.15612 -2.64039 2.75446 0.11407
magnitude: 0.90652 au
magnitude: 2.30420 debye
