program: Orca
programVersion: 5.0.2
elementType: O O O O O O N N N C C C C C C C C C C C C C C C C C H H H H H H H H H H H H H H H H H H H
charge: 0
multiplicity: 1
keywords: wb97x-d3
keywords: def2-TZVPP
keywords: def2/J RIJCOSX
keywords: DEFGRID2
keywords: scfconv7
keywords: smallprint printgap noloewdin
keywords: NOSOSCF
formula: C17H19N3O6
InChI: InChI=1/C17H19N3O6/c1-10(20-25-5)11-7-6-8-12(15(11)16(21)24-4)26-17-18-13(22-2)9-14(19-17)23-3/h6-9H,1-5H3
45 atoms
O  1.449995 0.507172 1.178604
O  -1.836429 2.174729 0.094457
O  -0.043182 1.462502 -1.032326
O  -5.528371 0.039211 0.526596
O  5.242501 1.134741 -1.173151
O  2.458317 -2.470282 -2.1195
N  -4.365488 -0.139999 1.211214
N  3.323974 0.82862 0.020299
N  1.921818 -1.008071 -0.454547
C  -2.069077 -0.495367 1.124996
C  -0.883206 0.176222 0.800728
C  0.301661 -0.195764 1.426353
C  -2.034405 -1.502269 2.084144
C  -3.353864 -0.211826 0.443442
C  0.327057 -1.193947 2.38337
C  -0.849122 -1.841651 2.714103
C  -0.850546 1.318132 -0.15659
C  -3.427971 -0.142708 -1.053484
C  2.257104 0.08314 0.193539
C  4.144332 0.432274 -0.93977
C  2.749576 -1.385338 -1.417538
C  3.912171 -0.693241 -1.721702
C  -1.934537 3.305497 -0.760641
C  -6.60108 0.141716 1.433005
C  5.47952 2.285818 -0.379368
C  1.250951 -3.150061 -1.818335
H  -2.949381 -2.023403 2.327496
H  1.262065 -1.447999 2.864121
H  -0.840897 -2.624539 3.460636
H  -4.074833 -0.938333 -1.427757
H  -2.452855 -0.270093 -1.518162
H  -3.86169 0.797553 -1.393805
H  4.585682 -1.00371 -2.505491
H  -2.101598 3.012368 -1.797811
H  -1.035875 3.920583 -0.713358
H  -2.786098 3.876493 -0.401924
H  -6.715656 -0.764746 2.032616
H  -6.485384 0.994546 2.106007
H  -7.496858 0.283547 0.830783
H  5.572624 2.037836 0.678426
H  4.685553 3.024856 -0.489105
H  6.417391 2.70197 -0.738639
H  0.379202 -2.51276 -1.970067
H  1.210365 -3.993232 -2.503132
H  1.233032 -3.513589 -0.790463
totalener: -1274.91777722 hartree
nucrepener: 2417.31119054 hartree
electener: -3692.22896776 hartree
oneelecener: -6545.34652649 hartree
twoeener: 2853.11755872 hartree
kineticenergy: 1269.83886642 hartree
xcener: -119.071428526786 hartree
chargesum: 0.0000000
charge: -0.281154 -0.251991 -0.350645 -0.207267 -0.270223 -0.271124 -0.142287 -0.358608 -0.386486 0.094996 -0.082179 0.284306 -0.174268 0.158163 -0.170322 -0.093177 0.337856 -0.281663 0.366654 0.397665 0.372919 -0.300345 -0.143767 -0.111884 -0.119772 -0.116919 0.120040 0.123440 0.127944 0.114892 0.097113 0.099544 0.120388 0.107147 0.120787 0.123298 0.092511 0.097169 0.101105 0.105331 0.109001 0.116107 0.103246 0.119362 0.103095
qa: -0.2812 -0.2520 -0.3506 -0.2073 -0.2702 -0.2711 -0.1423 -0.3586 -0.3865 0.0950 -0.0822 0.2843 -0.1743 0.1582 -0.1703 -0.0932 0.3379 -0.2817 0.3667 0.3977 0.3729 -0.3003 -0.1438 -0.1119 -0.1198 -0.1169 0.1200 0.1234 0.1279 0.1149 0.0971 0.0995 0.1204 0.1071 0.1208 0.1233 0.0925 0.0972 0.1011 0.1053 0.1090 0.1161 0.1032 0.1194 0.1031
va: 2.1338 2.1329 2.1402 1.9709 2.1373 2.1398 2.8556 2.9660 2.9142 3.7062 3.7612 3.8002 4.0130 3.7390 4.0725 3.9426 4.1475 3.9632 4.2751 4.0218 4.0842 3.9241 3.8898 3.9270 3.8798 3.8920 1.0272 1.0081 0.9995 1.0054 1.0099 1.0065 1.0236 0.9939 0.9969 0.9923 0.9961 0.9965 0.9952 0.9994 0.9988 0.9927 0.9953 0.9941 0.9961
dispcorr: -0.021621364 hartree
energy: -1274.939398582477
dipole: -14.74898 13.83274 -0.91624 1.21386 -1.36790 -0.15404 -2.89617 2.99037 0.09420
magnitude: 0.93386 au
magnitude: 2.37368 debye
