program: Orca
programVersion: 5.0.2
elementType: O O O O O O N N N C C C C C C C C C C C C C C C C C H H H H H H H H H H H H H H H H H H H
charge: 0
multiplicity: 1
keywords: wb97x-d3
keywords: def2-TZVPP
keywords: def2/J RIJCOSX
keywords: DEFGRID2
keywords: scfconv7
keywords: smallprint printgap noloewdin
keywords: NOSOSCF
formula: C17H19N3O6
InChI: InChI=1/C17H19N3O6/c1-10(20-25-5)11-7-6-8-12(15(11)16(21)24-4)26-17-18-13(22-2)9-14(19-17)23-3/h6-9H,1-5H3
45 atoms
O  1.05167 -1.035138 1.074092
O  0.289471 1.567244 0.492404
O  -1.401362 1.633939 1.953279
O  -5.583298 1.111683 0.372304
O  2.578626 -0.549978 -3.192493
O  5.266859 0.441671 0.4695
N  -4.643064 0.141435 0.530632
N  1.776815 -0.814046 -1.074071
N  3.134147 -0.302191 0.786764
C  -2.460043 -0.561987 0.171275
C  -1.147051 -0.277979 0.563495
C  -0.20402 -1.298823 0.583272
C  -2.787303 -1.865657 -0.187778
C  -3.501632 0.488257 0.088456
C  -0.536857 -2.593283 0.231691
C  -1.83664 -2.871552 -0.151546
C  -0.786746 1.069377 1.092758
C  -3.219688 1.806612 -0.570031
C  2.021028 -0.699997 0.210983
C  2.765992 -0.467587 -1.88487
C  4.114762 0.031014 -0.038205
C  3.995473 -0.022127 -1.421969
C  0.789985 2.801534 0.990185
C  -6.809613 0.675893 0.910343
C  1.316552 -1.00138 -3.657693
C  5.391266 0.497828 1.88136
H  -3.799305 -2.082901 -0.498627
H  0.214869 -3.369795 0.271357
H  -2.110643 -3.880685 -0.428549
H  -3.929282 1.976293 -1.380973
H  -2.219172 1.840011 -0.995415
H  -3.330578 2.633544 0.130897
H  4.800041 0.256194 -2.084993
H  0.059465 3.603153 0.879292
H  1.671119 3.025861 0.395775
H  1.069113 2.722463 2.04065
H  -7.177488 -0.223391 0.40969
H  -6.734878 0.475787 1.981632
H  -7.518512 1.486233 0.748805
H  0.505623 -0.352509 -3.325714
H  1.100198 -2.016653 -3.323755
H  1.37994 -0.981338 -4.742723
H  6.40324 0.845374 2.072887
H  4.676765 1.192418 2.324358
H  5.247573 -0.480047 2.341349
totalener: -1274.91794589 hartree
nucrepener: 2427.29343166 hartree
electener: -3702.21137755 hartree
oneelecener: -6564.91624546 hartree
twoeener: 2862.70486792 hartree
kineticenergy: 1269.83805974 hartree
xcener: -119.070377824408 hartree
chargesum: 0.0000000
charge: -0.280723 -0.266769 -0.329727 -0.206042 -0.268648 -0.267958 -0.143509 -0.376654 -0.355259 0.093072 -0.042451 0.269960 -0.166968 0.156166 -0.179355 -0.092371 0.322024 -0.281580 0.335196 0.372200 0.395997 -0.307511 -0.136678 -0.112839 -0.116172 -0.118077 0.118946 0.118155 0.127072 0.109753 0.084055 0.121876 0.123336 0.117735 0.112473 0.118259 0.090915 0.100283 0.100709 0.105751 0.103489 0.120737 0.119054 0.103519 0.108556
qa: -0.2807 -0.2668 -0.3297 -0.2060 -0.2686 -0.2680 -0.1435 -0.3767 -0.3553 0.0931 -0.0425 0.2700 -0.1670 0.1562 -0.1794 -0.0924 0.3220 -0.2816 0.3352 0.3722 0.3960 -0.3075 -0.1367 -0.1128 -0.1162 -0.1181 0.1189 0.1182 0.1271 0.1098 0.0841 0.1219 0.1233 0.1177 0.1125 0.1183 0.0909 0.1003 0.1007 0.1058 0.1035 0.1207 0.1191 0.1035 0.1086
va: 2.1296 2.1120 2.1755 1.9782 2.1426 2.1374 2.8650 2.9143 2.9377 3.7319 3.7484 3.8165 4.0016 3.7480 4.0659 3.9373 4.1885 3.9559 4.3115 4.0810 4.0055 3.9209 3.8916 3.9278 3.8838 3.8801 1.0286 1.0106 0.9995 1.0067 1.0116 1.0048 1.0236 0.9955 0.9941 0.9950 0.9955 0.9961 0.9955 0.9966 0.9964 0.9937 0.9925 0.9983 0.9992
dispcorr: -0.022175391 hartree
energy: -1274.940121283882
dipole: -8.78309 9.02703 0.24394 6.68364 -6.67003 0.01361 -3.19835 2.30244 -0.89592
magnitude: 0.92863 au
magnitude: 2.36040 debye
