program: Orca
programVersion: 5.0.2
elementType: O O O O O O N N N C C C C C C C C C C C C C C C C C H H H H H H H H H H H H H H H H H H H
charge: 0
multiplicity: 1
keywords: wb97x-d3
keywords: def2-TZVPP
keywords: def2/J RIJCOSX
keywords: DEFGRID2
keywords: scfconv7
keywords: smallprint printgap noloewdin
keywords: NOSOSCF
formula: C17H19N3O6
InChI: InChI=1/C17H19N3O6/c1-10(20-25-5)11-7-6-8-12(15(11)16(21)24-4)26-17-18-13(22-2)9-14(19-17)23-3/h6-9H,1-5H3
45 atoms
O  0.955656 -1.115499 -1.26593
O  -0.081085 1.419411 -0.344541
O  -1.476814 1.346187 -2.091497
O  -4.258528 2.034172 0.576128
O  2.330333 -0.56675 3.041684
O  4.969025 0.804293 -0.53543
N  -3.249404 1.154785 0.364841
N  1.621514 -0.888541 0.899933
N  2.941677 -0.168056 -0.917389
C  -2.553173 -0.963802 -0.268994
C  -1.277366 -0.559822 -0.675885
C  -0.273904 -1.508928 -0.795924
C  -2.784563 -2.312811 -0.017746
C  -3.63578 0.014751 -0.04545
C  -0.506427 -2.849256 -0.545467
C  -1.772857 -3.248398 -0.160075
C  -0.990309 0.841722 -1.121555
C  -5.061464 -0.381521 -0.280759
C  1.872372 -0.70647 -0.37508
C  2.541558 -0.441779 1.741492
C  3.861858 0.252417 -0.062643
C  3.720486 0.154072 1.316459
C  0.358247 2.712245 -0.732542
C  -3.722522 3.300372 0.886652
C  1.089314 -1.11337 3.461881
C  5.116376 0.903358 -1.942504
H  -3.764881 -2.638278 0.30428
H  0.296139 -3.564272 -0.665442
H  -1.972582 -4.292883 0.037415
H  -5.650809 0.463501 -0.629756
H  -5.528612 -0.740844 0.63879
H  -5.125917 -1.17458 -1.022701
H  4.47112 0.512862 2.003624
H  1.109137 3.003226 -0.002911
H  -0.460804 3.432287 -0.720185
H  0.80254 2.702275 -1.72798
H  -3.092799 3.265661 1.778465
H  -3.139828 3.705975 0.055881
H  -4.572753 3.953374 1.075031
H  0.965496 -2.143888 3.12761
H  0.24478 -0.530573 3.093028
H  1.109054 -1.083204 4.548344
H  5.099917 -0.075444 -2.422491
H  4.33424 1.516804 -2.390792
H  6.08401 1.371733 -2.103678
totalener: -1274.91716330 hartree
nucrepener: 2470.31434629 hartree
electener: -3745.23150959 hartree
oneelecener: -6651.27391009 hartree
twoeener: 2906.04240050 hartree
kineticenergy: 1269.85530861 hartree
xcener: -119.076356064290 hartree
chargesum: 0.0000000
charge: -0.280968 -0.259827 -0.336089 -0.217234 -0.269745 -0.268470 -0.134830 -0.368853 -0.350979 0.035400 0.000985 0.271465 -0.172338 0.185283 -0.176315 -0.111826 0.335115 -0.277833 0.320367 0.374453 0.397201 -0.308389 -0.143529 -0.117853 -0.117939 -0.117436 0.125080 0.120373 0.126265 0.107168 0.103122 0.098501 0.122350 0.112504 0.110880 0.117776 0.098968 0.096315 0.107978 0.102899 0.111004 0.118743 0.107152 0.105006 0.118100
qa: -0.2810 -0.2598 -0.3361 -0.2172 -0.2697 -0.2685 -0.1348 -0.3689 -0.3510 0.0354 0.0010 0.2715 -0.1723 0.1853 -0.1763 -0.1118 0.3351 -0.2778 0.3204 0.3745 0.3972 -0.3084 -0.1435 -0.1179 -0.1179 -0.1174 0.1251 0.1204 0.1263 0.1072 0.1031 0.0985 0.1224 0.1125 0.1109 0.1178 0.0990 0.0963 0.1080 0.1029 0.1110 0.1187 0.1072 0.1050 0.1181
va: 2.1277 2.1121 2.1768 1.9749 2.1428 2.1366 2.8664 2.9103 2.9369 3.8212 3.7654 3.7928 3.9520 3.7347 4.0834 3.9742 4.2206 3.9467 4.3307 4.0778 4.0023 3.9178 3.9024 3.9252 3.8820 3.8803 1.0030 1.0091 1.0011 1.0185 0.9970 1.0027 1.0238 0.9940 0.9952 0.9962 0.9950 0.9915 0.9970 0.9960 0.9971 0.9938 0.9996 0.9982 0.9925
dispcorr: -0.022882299 hartree
energy: -1274.940045600886
dipole: -8.22017 8.01128 -0.20889 7.22188 -7.35946 -0.13758 4.43555 -3.55692 0.87863
magnitude: 0.91354 au
magnitude: 2.32203 debye
