program: Orca
programVersion: 5.0.2
elementType: O O O O O O N N N C C C C C C C C C C C C C C C C C H H H H H H H H H H H H H H H H H H H
charge: 0
multiplicity: 1
keywords: wb97x-d3
keywords: def2-TZVPP
keywords: def2/J RIJCOSX
keywords: DEFGRID2
keywords: scfconv7
keywords: smallprint printgap noloewdin
keywords: NOSOSCF
formula: C17H19N3O6
InChI: InChI=1/C17H19N3O6/c1-10(20-25-5)11-7-6-8-12(15(11)16(21)24-4)26-17-18-13(22-2)9-14(19-17)23-3/h6-9H,1-5H3
45 atoms
O  1.052955 -1.401145 1.230145
O  -0.868856 1.384485 -0.644424
O  -0.04306 1.290852 1.430901
O  -4.354384 2.013772 0.569666
O  2.14587 0.12645 -2.920669
O  5.10538 0.482303 0.647717
N  -3.395863 1.077787 0.790868
N  1.563579 -0.660179 -0.859543
N  3.064242 -0.486432 0.953001
C  -2.443277 -0.954176 0.198019
C  -1.12127 -0.628314 0.514845
C  -0.229599 -1.653122 0.826277
C  -2.831084 -2.29072 0.159816
C  -3.467335 0.090853 -0.007436
C  -0.623813 -2.978619 0.791973
C  -1.928681 -3.295135 0.457014
C  -0.631369 0.782842 0.519856
C  -4.505086 -0.061677 -1.078141
C  1.922562 -0.818342 0.39475
C  2.451289 -0.068613 -1.647829
C  3.937834 0.104282 0.153229
C  3.690205 0.355021 -1.192622
C  -0.441913 2.733276 -0.749099
C  -4.197264 3.073971 1.48466
C  0.883564 -0.331758 -3.382884
C  5.344258 0.270452 2.030383
H  -3.857471 -2.544716 -0.070601
H  0.095536 -3.750429 1.029889
H  -2.243232 -4.329734 0.435766
H  -5.504349 -0.170304 -0.653587
H  -4.300959 -0.922076 -1.709997
H  -4.527887 0.824941 -1.712341
H  4.410174 0.83974 -1.833877
H  -0.943254 3.370125 -0.018759
H  -0.707954 3.055482 -1.752365
H  0.636023 2.826381 -0.612084
H  -4.996526 3.781545 1.271973
H  -4.28368 2.734103 2.518778
H  -3.234001 3.575765 1.363186
H  0.836002 -0.04651 -4.430956
H  0.059426 0.126106 -2.836874
H  0.792574 -1.415272 -3.297429
H  4.613153 0.788904 2.650884
H  5.323468 -0.788728 2.287708
H  6.336342 0.672023 2.220465
totalener: -1274.91648195 hartree
nucrepener: 2486.94713310 hartree
electener: -3761.86361504 hartree
oneelecener: -6684.56201078 hartree
twoeener: 2922.69839573 hartree
kineticenergy: 1269.84558116 hartree
xcener: -119.075801678743 hartree
chargesum: -0.0000000
charge: -0.260672 -0.266829 -0.316480 -0.208434 -0.269377 -0.269101 -0.143527 -0.384950 -0.352454 0.021191 0.027411 0.241995 -0.171619 0.174846 -0.173033 -0.110823 0.313759 -0.277962 0.345439 0.364881 0.406588 -0.309258 -0.133866 -0.105627 -0.115005 -0.121064 0.124113 0.125050 0.127015 0.111070 0.087802 0.105010 0.121884 0.111093 0.111781 0.116030 0.103759 0.103445 0.083304 0.119549 0.099470 0.106661 0.113958 0.106211 0.116768
qa: -0.2607 -0.2668 -0.3165 -0.2084 -0.2694 -0.2691 -0.1435 -0.3850 -0.3525 0.0212 0.0274 0.2420 -0.1716 0.1748 -0.1730 -0.1108 0.3138 -0.2780 0.3454 0.3649 0.4066 -0.3093 -0.1339 -0.1056 -0.1150 -0.1211 0.1241 0.1251 0.1270 0.1111 0.0878 0.1050 0.1219 0.1111 0.1118 0.1160 0.1038 0.1034 0.0833 0.1195 0.0995 0.1067 0.1140 0.1062 0.1168
va: 2.1567 2.0766 2.1905 1.9707 2.1321 2.1404 2.8582 2.9120 2.9676 3.7835 3.6564 3.7801 3.9583 3.7169 4.0655 3.9719 4.1677 3.9512 4.3160 4.0655 4.0131 3.9238 3.8920 3.9280 3.8732 3.8751 1.0040 1.0098 1.0010 0.9996 1.0079 1.0080 1.0241 0.9968 0.9932 0.9957 0.9935 0.9987 0.9901 0.9935 0.9979 0.9993 0.9984 0.9991 0.9922
dispcorr: -0.023699704 hartree
energy: -1274.940181651293
dipole: -10.92930 10.11275 -0.81655 8.05316 -8.11810 -0.06494 -5.11390 4.11505 -0.99885
magnitude: 1.29177 au
magnitude: 3.28342 debye
