program: Orca
programVersion: 5.0.2
elementType: O O O O O O N N N C C C C C C C C C C C C C C C C C H H H H H H H H H H H H H H H H H H H
charge: 0
multiplicity: 1
keywords: wb97x-d3
keywords: def2-TZVPP
keywords: def2/J RIJCOSX
keywords: DEFGRID2
keywords: scfconv7
keywords: smallprint printgap noloewdin
keywords: NOSOSCF
formula: C17H19N3O6
InChI: InChI=1/C17H19N3O6/c1-10(20-25-5)11-7-6-8-12(15(11)16(21)24-4)26-17-18-13(22-2)9-14(19-17)23-3/h6-9H,1-5H3
45 atoms
O  1.024132 -1.339846 1.185866
O  -0.054628 1.242882 1.268992
O  -0.938634 1.409826 -0.775517
O  -4.478616 1.937231 0.373686
O  2.08398 0.133676 -2.993137
O  5.051537 0.581036 0.55604
N  -3.504161 1.035209 0.659853
N  1.520376 -0.636473 -0.920465
N  3.017468 -0.396184 0.888278
C  -2.494849 -0.998285 0.169034
C  -1.172114 -0.630719 0.437717
C  -0.261357 -1.620394 0.806951
C  -2.865163 -2.337716 0.23215
C  -3.536526 0.016053 -0.09898
C  -0.63877 -2.950573 0.87041
C  -1.943097 -3.307718 0.580397
C  -0.733876 0.783439 0.226594
C  -4.540643 -0.200603 -1.190516
C  1.882014 -0.762794 0.335137
C  2.394473 -0.040776 -1.722631
C  3.885336 0.182166 0.071736
C  3.631225 0.404289 -1.276519
C  0.502062 2.543552 1.14469
C  -4.298716 3.093529 1.156074
C  0.799558 -0.287131 -3.437011
C  5.311076 0.368147 1.933775
H  -3.892032 -2.618963 0.037767
H  0.095633 -3.693978 1.149165
H  -2.241955 -4.3458 0.634481
H  -5.552347 -0.292733 -0.79252
H  -4.312749 -1.092156 -1.768976
H  -4.544704 0.65202 -1.870155
H  4.343052 0.886891 -1.928423
H  1.051046 2.720731 2.065066
H  -0.274657 3.30021 1.030028
H  1.183423 2.609898 0.295513
H  -4.325717 2.869835 2.224806
H  -3.356281 3.595253 0.923966
H  -5.124003 3.759495 0.909998
H  0.753323 -0.014172 -4.488186
H  0.001091 0.212137 -2.890138
H  0.674354 -1.365613 -3.335746
H  5.291246 -0.690914 2.191785
H  6.307025 0.766903 2.109218
H  4.592253 0.88811 2.567618
totalener: -1274.91732193 hartree
nucrepener: 2487.31700161 hartree
electener: -3762.23432353 hartree
oneelecener: -6685.36958154 hartree
twoeener: 2923.13525801 hartree
kineticenergy: 1269.84107520 hartree
xcener: -119.075311483443 hartree
chargesum: 0.0000000
charge: -0.261716 -0.242591 -0.362155 -0.207610 -0.265110 -0.267599 -0.139317 -0.373914 -0.351836 0.049053 0.042234 0.233178 -0.174098 0.188524 -0.176582 -0.105650 0.295432 -0.278866 0.310671 0.385264 0.396452 -0.308104 -0.142405 -0.113867 -0.125192 -0.119107 0.124252 0.124812 0.127359 0.107586 0.087029 0.110468 0.122276 0.122175 0.114715 0.106315 0.097950 0.092119 0.103725 0.117754 0.122895 0.102111 0.107333 0.118730 0.105305
qa: -0.2617 -0.2426 -0.3622 -0.2076 -0.2651 -0.2676 -0.1393 -0.3739 -0.3518 0.0491 0.0422 0.2332 -0.1741 0.1885 -0.1766 -0.1057 0.2954 -0.2789 0.3107 0.3853 0.3965 -0.3081 -0.1424 -0.1139 -0.1252 -0.1191 0.1243 0.1248 0.1274 0.1076 0.0870 0.1105 0.1223 0.1222 0.1147 0.1063 0.0980 0.0921 0.1037 0.1178 0.1229 0.1021 0.1073 0.1187 0.1053
va: 2.1441 2.1472 2.1158 1.9744 2.1495 2.1379 2.8712 2.9121 2.9377 3.7325 3.6434 3.8216 3.9484 3.7038 4.0605 3.9694 4.1705 3.9514 4.3451 4.0619 4.0005 3.9164 3.9082 3.9286 3.8590 3.8786 1.0046 1.0103 1.0006 0.9994 1.0081 1.0081 1.0244 0.9945 0.9939 0.9942 0.9966 0.9907 0.9964 0.9947 1.0032 0.9973 0.9995 0.9924 0.9988
dispcorr: -0.023626535 hartree
energy: -1274.940948463495
dipole: -8.66380 8.42232 -0.24148 7.56956 -7.68777 -0.11821 -1.10621 1.19438 0.08818
magnitude: 0.28295 au
magnitude: 0.71920 debye
