program: Orca
programVersion: 5.0.2
elementType: O O O O O O N N N C C C C C C C C C C C C C C C C C H H H H H H H H H H H H H H H H H H H
charge: 0
multiplicity: 1
keywords: wb97x-d3
keywords: def2-TZVPP
keywords: def2/J RIJCOSX
keywords: DEFGRID2
keywords: scfconv7
keywords: smallprint printgap noloewdin
keywords: NOSOSCF
formula: C17H19N3O6
InChI: InChI=1/C17H19N3O6/c1-10(20-25-5)11-7-6-8-12(15(11)16(21)24-4)26-17-18-13(22-2)9-14(19-17)23-3/h6-9H,1-5H3
45 atoms
O  1.164696 -0.927011 0.995421
O  -1.453575 1.679759 1.839406
O  0.336251 1.734159 0.501733
O  -5.469051 1.196285 0.659561
O  2.72455 -0.940653 -3.30204
O  5.445368 0.279491 0.25356
N  -4.509628 0.232584 0.7802
N  1.884488 -0.933736 -1.173175
N  3.27129 -0.32411 0.640687
C  -2.381844 -0.508927 0.214364
C  -1.054695 -0.206343 0.548388
C  -0.106539 -1.222124 0.555823
C  -2.711509 -1.820542 -0.108882
C  -3.435074 0.53331 0.162748
C  -0.441412 -2.52864 0.251227
C  -1.751364 -2.820892 -0.084886
C  -0.634322 1.166385 0.94189
C  -3.235571 1.780988 -0.638867
C  2.141654 -0.716976 0.094674
C  2.900246 -0.734859 -2.006249
C  4.27139 -0.122867 -0.207625
C  4.1501 -0.316584 -1.577386
C  -1.224879 3.030268 2.255237
C  -6.641981 0.805331 1.349534
C  1.461198 -1.415432 -3.762439
C  5.597836 0.512112 1.651142
H  -3.726858 -2.059181 -0.393083
H  0.31221 -3.304165 0.28576
H  -2.027082 -3.836625 -0.333512
H  -3.366382 2.68201 -0.037606
H  -3.972784 1.825657 -1.443664
H  -2.253464 1.814163 -1.105364
H  4.972064 -0.155442 -2.25948
H  -0.26959 3.124998 2.770468
H  -2.031051 3.268494 2.942183
H  -1.254502 3.715935 1.408899
H  -7.360926 1.61021 1.208184
H  -7.061994 -0.117944 0.944633
H  -6.460642 0.677983 2.418849
H  1.562773 -1.518065 -4.839533
H  0.658986 -0.711107 -3.544319
H  1.21566 -2.386612 -3.333531
H  5.423565 -0.39184 2.233928
H  6.629208 0.827716 1.784044
H  4.935241 1.302415 2.003177
elementType: O N C H
totalener: -1274.93447833 hartree
nucrepener: 2398.50727867 hartree
electener: -3673.44175700 hartree
oneelecener: -6509.49108682 hartree
twoeener: 2836.04932982 hartree
cpcmener: -0.04123956 hartree
kineticenergy: 1269.73354517 hartree
xcener: -119.057824754957 hartree
chargesum: -0.0000000
charge: -0.312397 -0.264399 -0.461887 -0.246881 -0.303772 -0.303006 -0.174356 -0.413314 -0.406296 0.094398 -0.091927 0.310285 -0.215361 0.179806 -0.211562 -0.105537 0.414629 -0.272382 0.384846 0.404337 0.427311 -0.323509 -0.134952 -0.109740 -0.113291 -0.113353 0.144603 0.151981 0.164236 0.108807 0.123156 0.104410 0.143455 0.129962 0.133208 0.122055 0.116101 0.103017 0.103134 0.132529 0.112922 0.112875 0.111704 0.130960 0.113198
qa: -0.3124 -0.2644 -0.4619 -0.2469 -0.3038 -0.3030 -0.1744 -0.4133 -0.4063 0.0944 -0.0919 0.3103 -0.2154 0.1798 -0.2116 -0.1055 0.4146 -0.2724 0.3848 0.4043 0.4273 -0.3235 -0.1350 -0.1097 -0.1133 -0.1134 0.1446 0.1520 0.1642 0.1088 0.1232 0.1044 0.1435 0.1300 0.1332 0.1221 0.1161 0.1030 0.1031 0.1325 0.1129 0.1129 0.1117 0.1310 0.1132
va: 2.0851 2.1483 2.0307 1.9385 2.1157 2.1147 2.8426 2.9077 2.9428 3.6516 3.7913 3.6589 3.9884 3.7143 4.0078 3.9007 4.1165 3.9525 4.2638 4.0386 3.9942 3.9243 3.8467 3.8907 3.8483 3.8478 1.0160 1.0016 0.9873 1.0029 1.0020 1.0104 1.0167 0.9936 0.9935 0.9915 0.9935 0.9938 0.9948 0.9942 0.9949 0.9938 0.9968 0.9934 0.9966
dispcorr: -0.021247647 hartree
energy: -1274.955725974690
dipole: -13.24236 12.03808 -1.20427 6.74194 -6.89951 -0.15756 -0.06314 -0.25508 -0.31822
magnitude: 1.25553 au
magnitude: 3.19131 debye
