program: Orca
programVersion: 5.0.2
elementType: O O O O O O N N N C C C C C C C C C C C C C C C C C H H H H H H H H H H H H H H H H H H H
charge: 0
multiplicity: 1
keywords: wb97x-d3
keywords: def2-TZVPP
keywords: def2/J RIJCOSX
keywords: DEFGRID2
keywords: scfconv7
keywords: smallprint printgap noloewdin
keywords: NOSOSCF
formula: C17H19N3O6
InChI: InChI=1/C17H19N3O6/c1-10(20-25-5)11-7-6-8-12(15(11)16(21)24-4)26-17-18-13(22-2)9-14(19-17)23-3/h6-9H,1-5H3
45 atoms
O  0.573516 -1.300729 -1.147768
O  -1.189939 0.534011 -2.137193
O  -1.403052 1.896537 -0.380163
O  -4.719125 1.61937 2.393143
O  4.604959 -0.101022 -2.76713
O  3.695849 0.348936 1.758838
N  -3.636493 0.792407 2.305282
N  2.552112 -0.710459 -1.955399
N  2.084204 -0.464366 0.349695
C  -2.321049 -0.589238 0.976529
C  -1.339449 -0.444314 -0.013459
C  -0.353623 -1.41623 -0.138125
C  -2.276906 -1.695928 1.816599
C  -3.434101 0.379223 1.115964
C  -0.308584 -2.513566 0.704106
C  -1.276888 -2.64797 1.682907
C  -1.310915 0.787717 -0.851211
C  -4.289712 0.726426 -0.062667
C  1.792794 -0.798261 -0.88492
C  3.771796 -0.230986 -1.746691
C  3.314223 0.003437 0.540074
C  4.228556 0.147957 -0.491247
C  -1.107725 1.651193 -3.028254
C  -4.92246 2.016539 3.736671
C  4.156203 -0.438255 -4.076696
C  2.785762 0.181814 2.844441
H  -3.046402 -1.828618 2.564426
H  0.472517 -3.253312 0.587619
H  -1.259659 -3.506164 2.341117
H  -5.315804 0.397766 0.116164
H  -3.950777 0.234478 -0.971374
H  -4.32457 1.801327 -0.242294
H  5.225545 0.531389 -0.33032
H  -0.240178 2.270811 -2.804741
H  -2.012256 2.25689 -2.985844
H  -1.002977 1.228469 -4.022488
H  -5.115569 1.161238 4.387792
H  -4.071918 2.579084 4.127303
H  -5.799359 2.661179 3.733314
H  3.310818 0.17678 -4.38387
H  3.884655 -1.490535 -4.153272
H  4.998156 -0.23952 -4.734233
H  1.904425 0.812654 2.732388
H  2.474995 -0.856689 2.955017
H  3.332247 0.48641 3.732722
elementType: O N C H
totalener: -1274.93316542 hartree
nucrepener: 2403.71231704 hartree
electener: -3678.64548246 hartree
oneelecener: -6519.59378611 hartree
twoeener: 2840.94830365 hartree
cpcmener: -0.04162582 hartree
kineticenergy: 1269.73485362 hartree
xcener: -119.057273263536 hartree
chargesum: -0.0000000
charge: -0.312054 -0.272507 -0.455244 -0.246705 -0.302502 -0.302874 -0.176416 -0.414001 -0.421291 0.081828 -0.015358 0.232286 -0.197357 0.145255 -0.181757 -0.117265 0.418430 -0.268062 0.414031 0.425628 0.401600 -0.320597 -0.136335 -0.109863 -0.114100 -0.113549 0.145540 0.153609 0.164576 0.120192 0.100994 0.112704 0.143293 0.123133 0.125171 0.131673 0.103095 0.103455 0.115900 0.113911 0.111598 0.130973 0.114170 0.112181 0.132609
qa: -0.3121 -0.2725 -0.4552 -0.2467 -0.3025 -0.3029 -0.1764 -0.4140 -0.4213 0.0818 -0.0154 0.2323 -0.1974 0.1453 -0.1818 -0.1173 0.4184 -0.2681 0.4140 0.4256 0.4016 -0.3206 -0.1363 -0.1099 -0.1141 -0.1135 0.1455 0.1536 0.1646 0.1202 0.1010 0.1127 0.1433 0.1231 0.1252 0.1317 0.1031 0.1035 0.1159 0.1139 0.1116 0.1310 0.1142 0.1122 0.1326
va: 2.0899 2.1311 2.0405 1.9421 2.1154 2.1168 2.8458 2.9417 2.9192 3.6581 3.7180 3.7556 3.9702 3.7436 4.0056 3.9105 4.1399 3.9468 4.2193 3.9962 4.0408 3.9223 3.8628 3.8908 3.8495 3.8483 1.0143 0.9985 0.9871 1.0023 1.0108 1.0057 1.0167 0.9924 0.9923 0.9948 0.9938 0.9947 0.9934 0.9955 0.9964 0.9935 0.9946 0.9938 0.9941
dispcorr: -0.021086447 hartree
energy: -1274.954251865119
dipole: -9.54059 9.46905 -0.07154 5.65443 -6.49903 -0.84460 2.38137 -2.73980 -0.35843
magnitude: 0.92029 au
magnitude: 2.33920 debye
