program: Orca
programVersion: 5.0.2
elementType: O O O O O O N N N C C C C C C C C C C C C C C C C C H H H H H H H H H H H H H H H H H H H
charge: 0
multiplicity: 1
keywords: wb97x-d3
keywords: def2-TZVPP
keywords: def2/J RIJCOSX
keywords: DEFGRID2
keywords: scfconv7
keywords: smallprint printgap noloewdin
keywords: NOSOSCF
formula: C17H19N3O6
InChI: InChI=1/C17H19N3O6/c1-10(20-25-5)11-7-6-8-12(15(11)16(21)24-4)26-17-18-13(22-2)9-14(19-17)23-3/h6-9H,1-5H3
45 atoms
O  0.53584 -1.134065 -1.265457
O  -2.444456 0.74733 -1.3884
O  -0.525954 1.51942 -0.534763
O  -4.021108 1.948924 1.937582
O  4.433994 0.530048 -2.809105
O  3.769963 0.015346 1.75545
N  -3.025706 1.13423 1.498269
N  2.448151 -0.309602 -2.037357
N  2.113713 -0.568971 0.287682
C  -2.252088 -1.017365 1.090184
C  -1.322401 -0.631285 0.11615
C  -0.305422 -1.5043 -0.236738
C  -2.122318 -2.273241 1.676955
C  -3.319804 -0.106077 1.548251
C  -0.182977 -2.7550 0.340309
C  -1.100104 -3.132701 1.305244
C  -1.385509 0.675026 -0.605286
C  -4.612422 -0.66258 2.051256
C  1.755478 -0.646158 -0.971337
C  3.662697 0.167011 -1.795916
C  3.333227 -0.090503 0.50956
C  4.178903 0.306265 -0.513963
C  -2.643409 1.963238 -2.114681
C  -3.664495 3.306452 1.743382
C  3.945557 0.381651 -4.140066
C  2.920797 -0.404072 2.820743
H  -2.819374 -2.584871 2.443146
H  0.611162 -3.421722 0.031216
H  -1.016748 -4.103128 1.774968
H  -5.455029 -0.044349 1.745828
H  -4.619663 -0.705535 3.142381
H  -4.781612 -1.669271 1.677567
H  5.17067 0.692278 -0.329351
H  -1.823176 2.151806 -2.806585
H  -2.75585 2.812043 -1.43992
H  -3.562484 1.826279 -2.676387
H  -3.544612 3.544133 0.68373
H  -4.485007 3.89642 2.146693
H  -2.746478 3.56397 2.275111
H  4.743282 0.7382 -4.786068
H  3.052201 0.980926 -4.312814
H  3.732923 -0.660222 -4.378256
H  3.487706 -0.232694 3.731675
H  2.000613 0.178378 2.857735
H  2.674218 -1.463066 2.747609
elementType: O N C H
totalener: -1274.93466578 hartree
nucrepener: 2426.51309169 hartree
electener: -3701.44775747 hartree
oneelecener: -6566.26197168 hartree
twoeener: 2864.81421421 hartree
cpcmener: -0.04433448 hartree
kineticenergy: 1269.74840437 hartree
xcener: -119.064388154336 hartree
chargesum: 0.0000000
charge: -0.314407 -0.267989 -0.466154 -0.253445 -0.303447 -0.303650 -0.158116 -0.407254 -0.411809 0.060762 -0.089807 0.308233 -0.186753 0.186269 -0.207883 -0.116815 0.409940 -0.270574 0.387212 0.427607 0.401507 -0.319646 -0.131751 -0.113337 -0.114437 -0.114171 0.154526 0.154366 0.164376 0.103518 0.123574 0.102884 0.143656 0.125011 0.118065 0.132131 0.103259 0.122838 0.106677 0.131404 0.112962 0.112609 0.131856 0.113323 0.112880
qa: -0.3144 -0.2680 -0.4662 -0.2534 -0.3034 -0.3037 -0.1581 -0.4073 -0.4118 0.0608 -0.0898 0.3082 -0.1868 0.1863 -0.2079 -0.1168 0.4099 -0.2706 0.3872 0.4276 0.4015 -0.3196 -0.1318 -0.1133 -0.1144 -0.1142 0.1545 0.1544 0.1644 0.1035 0.1236 0.1029 0.1437 0.1250 0.1181 0.1321 0.1033 0.1228 0.1067 0.1314 0.1130 0.1126 0.1319 0.1133 0.1129
va: 2.0815 2.1272 2.0276 1.9386 2.1148 2.1158 2.8462 2.9473 2.9004 3.7656 3.8268 3.6547 3.9358 3.7461 4.0303 3.8973 4.1805 3.9478 4.2516 3.9930 4.0408 3.9225 3.8508 3.8955 3.8478 3.8495 0.9949 0.9989 0.9880 1.0122 0.9946 1.0027 1.0165 0.9950 0.9885 0.9943 0.9814 0.9934 0.9958 0.9934 0.9963 0.9965 0.9946 0.9951 0.9934
dispcorr: -0.021428353 hartree
energy: -1274.956094134637
dipole: -11.34501 10.00050 -1.34451 5.71089 -6.61207 -0.90118 4.30764 -3.71219 0.59545
magnitude: 1.72464 au
magnitude: 4.38370 debye
