program: Orca
programVersion: 5.0.2
elementType: O O O O O O N N N C C C C C C C C C C C C C C C C C H H H H H H H H H H H H H H H H H H H
charge: 0
multiplicity: 1
keywords: wb97x-d3
keywords: def2-TZVPP
keywords: def2/J RIJCOSX
keywords: DEFGRID2
keywords: scfconv7
keywords: smallprint printgap noloewdin
keywords: NOSOSCF
formula: C17H19N3O6
InChI: InChI=1/C17H19N3O6/c1-10(20-25-5)11-7-6-8-12(15(11)16(21)24-4)26-17-18-13(22-2)9-14(19-17)23-3/h6-9H,1-5H3
45 atoms
O  0.955827 -1.045672 1.008378
O  -0.441046 1.548519 0.560381
O  -1.401319 0.872932 2.465758
O  -4.584454 1.922778 0.30081
O  2.63317 -0.34429 -3.189033
O  5.136847 0.59602 0.603862
N  -3.494587 1.114671 0.252582
N  1.736262 -0.696384 -1.112354
N  3.013178 -0.231235 0.821051
C  -2.589721 -1.020124 0.154027
C  -1.326338 -0.607687 0.598622
C  -0.246449 -1.464327 0.47444
C  -2.712719 -2.286439 -0.410955
C  -3.767081 -0.131072 0.225892
C  -0.37158 -2.726905 -0.078129
C  -1.617387 -3.130022 -0.523589
C  -1.093753 0.686273 1.314425
C  -5.14065 -0.718907 0.229225
C  1.938961 -0.639575 0.181731
C  2.754297 -0.304684 -1.87136
C  4.015821 0.164601 0.047032
C  3.952012 0.147287 -1.340238
C  -0.134119 2.824084 1.13208
C  -4.185068 3.273254 0.462789
C  1.421134 -0.838908 -3.757185
C  5.23106 0.643211 2.025205
H  -3.672904 -2.623687 -0.77664
H  0.485993 -3.382562 -0.148464
H  -1.738565 -4.109952 -0.96425
H  -5.854681 -0.077972 0.74114
H  -5.148983 -1.691066 0.717625
H  -5.50157 -0.861192 -0.791859
H  4.778125 0.462657 -1.960679
H  0.392639 3.376272 0.359682
H  0.507699 2.724469 2.006699
H  -1.04407 3.360786 1.40216
H  -5.100376 3.861828 0.455564
H  -3.671525 3.43079 1.413687
H  -3.54273 3.606401 -0.354681
H  1.561534 -0.787743 -4.83343
H  0.564692 -0.226147 -3.478021
H  1.234647 -1.87331 -3.469673
H  4.488387 1.31397 2.456734
H  5.126974 -0.345449 2.471309
H  6.224617 1.027456 2.239652
elementType: O N C H
totalener: -1274.93388064 hartree
nucrepener: 2434.47831922 hartree
electener: -3709.41219986 hartree
oneelecener: -6581.48992382 hartree
twoeener: 2872.07772396 hartree
cpcmener: -0.04304358 hartree
kineticenergy: 1269.74307573 hartree
xcener: -119.063980442766 hartree
chargesum: -0.0000000
charge: -0.314036 -0.271404 -0.462148 -0.260716 -0.303174 -0.302944 -0.145769 -0.411317 -0.407870 0.050638 -0.090282 0.281294 -0.180598 0.175738 -0.211185 -0.120607 0.438941 -0.259008 0.388451 0.402816 0.427909 -0.320137 -0.138170 -0.118528 -0.113614 -0.115145 0.153573 0.153437 0.164248 0.103123 0.105908 0.122098 0.143829 0.131276 0.123555 0.122667 0.125721 0.107058 0.107848 0.133008 0.113403 0.112552 0.113648 0.112560 0.131350
qa: -0.3140 -0.2714 -0.4621 -0.2607 -0.3032 -0.3029 -0.1458 -0.4113 -0.4079 0.0506 -0.0903 0.2813 -0.1806 0.1757 -0.2112 -0.1206 0.4389 -0.2590 0.3885 0.4028 0.4279 -0.3201 -0.1382 -0.1185 -0.1136 -0.1151 0.1536 0.1534 0.1642 0.1031 0.1059 0.1221 0.1438 0.1313 0.1236 0.1227 0.1257 0.1071 0.1078 0.1330 0.1134 0.1126 0.1136 0.1126 0.1314
va: 2.0847 2.1205 2.0325 1.9381 2.1165 2.1152 2.8520 2.9079 2.9415 3.7939 3.8068 3.7016 3.9263 3.7985 4.0173 3.9021 4.1613 3.9401 4.2522 4.0401 3.9916 3.9219 3.8593 3.8866 3.8474 3.8490 0.9951 1.0002 0.9884 1.0173 1.0003 0.9948 1.0166 0.9949 0.9947 0.9916 0.9940 0.9907 0.9928 0.9942 0.9954 0.9935 0.9957 0.9962 0.9935
dispcorr: -0.021878613 hartree
energy: -1274.955759254398
dipole: -9.15071 8.88520 -0.26551 7.14034 -7.36421 -0.22387 -2.89213 1.20539 -1.68673
magnitude: 1.72212 au
magnitude: 4.37727 debye
