program: Orca
programVersion: 5.0.2
elementType: O O O O O O N N N C C C C C C C C C C C C C C C C C H H H H H H H H H H H H H H H H H H H
charge: 0
multiplicity: 1
keywords: wb97x-d3
keywords: def2-TZVPP
keywords: def2/J RIJCOSX
keywords: DEFGRID2
keywords: scfconv7
keywords: smallprint printgap noloewdin
keywords: NOSOSCF
formula: C17H19N3O6
InChI: InChI=1/C17H19N3O6/c1-10(20-25-5)11-7-6-8-12(15(11)16(21)24-4)26-17-18-13(22-2)9-14(19-17)23-3/h6-9H,1-5H3
45 atoms
O  0.465396 -1.061726 -1.339996
O  -0.66115 1.507808 -0.21125
O  -2.26107 0.82896 -1.620699
O  -4.307954 1.764048 1.662161
O  4.356216 0.718646 -2.764938
O  3.679608 -0.066875 1.758395
N  -3.288943 0.9725 1.243607
N  2.374172 -0.178618 -2.051027
N  2.032754 -0.578758 0.253128
C  -2.365707 -1.133427 0.959052
C  -1.423001 -0.681411 0.025724
C  -0.381183 -1.511936 -0.346498
C  -2.210637 -2.409947 1.492741
C  -3.481827 -0.276778 1.408919
C  -0.232606 -2.783988 0.177623
C  -1.157454 -3.225738 1.106302
C  -1.529192 0.633599 -0.682438
C  -4.693905 -0.898723 2.021887
C  1.681295 -0.585961 -1.010005
C  3.584412 0.291612 -1.777429
C  3.247759 -0.103779 0.507492
C  4.094952 0.357219 -0.487544
C  -0.651256 2.809645 -0.803935
C  -4.049318 3.111562 1.305985
C  3.868962 0.654029 -4.102688
C  2.827933 -0.545149 2.797138
H  -2.915709 -2.778583 2.225066
H  0.585671 -3.415139 -0.142944
H  -1.058616 -4.212913 1.536341
H  -4.914732 -1.85812 1.558107
H  -5.571319 -0.264607 1.921804
H  -4.537018 -1.078577 3.087676
H  5.083314 0.738154 -0.275508
H  -0.379752 2.764875 -1.858117
H  0.100761 3.376072 -0.263189
H  -1.619123 3.299327 -0.696143
H  -3.132502 3.483427 1.767537
H  -3.985245 3.234947 0.222762
H  -4.892869 3.689927 1.677622
H  4.669548 1.04456 -4.724992
H  2.979325 1.26825 -4.238859
H  3.650263 -0.369936 -4.40446
H  3.399384 -0.440155 3.715359
H  1.915449 0.045594 2.874614
H  2.567633 -1.593949 2.656575
elementType: O N C H
totalener: -1274.93361916 hartree
nucrepener: 2440.49017462 hartree
electener: -3715.42379378 hartree
oneelecener: -6593.52242011 hartree
twoeener: 2878.09862633 hartree
cpcmener: -0.04321911 hartree
kineticenergy: 1269.75311027 hartree
xcener: -119.066677062094 hartree
chargesum: -0.0000000
charge: -0.312969 -0.271313 -0.462328 -0.263514 -0.303138 -0.303244 -0.140281 -0.407942 -0.410525 0.042036 -0.089501 0.269429 -0.177016 0.171075 -0.204823 -0.124161 0.450430 -0.253704 0.384383 0.427916 0.402736 -0.317665 -0.139947 -0.118264 -0.115843 -0.113749 0.152953 0.154683 0.164198 0.106414 0.103091 0.120751 0.143460 0.124481 0.131732 0.122714 0.108081 0.106898 0.126434 0.131510 0.113543 0.112946 0.132031 0.113967 0.112032
qa: -0.3130 -0.2713 -0.4623 -0.2635 -0.3031 -0.3032 -0.1403 -0.4079 -0.4105 0.0420 -0.0895 0.2694 -0.1770 0.1711 -0.2048 -0.1242 0.4504 -0.2537 0.3844 0.4279 0.4027 -0.3177 -0.1399 -0.1183 -0.1158 -0.1137 0.1530 0.1547 0.1642 0.1064 0.1031 0.1208 0.1435 0.1245 0.1317 0.1227 0.1081 0.1069 0.1264 0.1315 0.1135 0.1129 0.1320 0.1140 0.1120
va: 2.0833 2.1188 2.0317 1.9392 2.1154 2.1167 2.8532 2.9416 2.9001 3.8065 3.7994 3.7159 3.9248 3.8171 4.0328 3.9054 4.1503 3.9375 4.2529 3.9903 4.0383 3.9216 3.8577 3.8873 3.8487 3.8494 0.9955 0.9985 0.9884 0.9998 1.0190 0.9950 1.0166 0.9951 0.9947 0.9923 0.9917 0.9911 0.9942 0.9934 0.9957 0.9964 0.9944 0.9951 0.9935
dispcorr: -0.022076325 hartree
energy: -1274.955695484450
dipole: -7.20478 7.62341 0.41863 6.88815 -7.10248 -0.21432 6.69435 -5.00410 1.69025
magnitude: 1.75446 au
magnitude: 4.45948 debye
