program: Orca
programVersion: 5.0.2
elementType: O O O O O O N N N C C C C C C C C C C C C C C C C C H H H H H H H H H H H H H H H H H H H
charge: 0
multiplicity: 1
keywords: wb97x-d3
keywords: def2-TZVPP
keywords: def2/J RIJCOSX
keywords: DEFGRID2
keywords: scfconv7
keywords: smallprint printgap noloewdin
keywords: NOSOSCF
formula: C17H19N3O6
InChI: InChI=1/C17H19N3O6/c1-10(20-25-5)11-7-6-8-12(15(11)16(21)24-4)26-17-18-13(22-2)9-14(19-17)23-3/h6-9H,1-5H3
45 atoms
O  1.000222 -1.406645 1.162984
O  -0.104244 1.187226 1.328551
O  -0.88844 1.373545 -0.753703
O  -4.35891 2.016811 0.41505
O  2.065371 0.10836 -3.012906
O  4.935275 0.723969 0.580432
N  -3.474017 1.016739 0.687645
N  1.505708 -0.712372 -0.949748
N  2.953046 -0.377961 0.888599
C  -2.516948 -1.015999 0.144418
C  -1.190637 -0.674116 0.430366
C  -0.294419 -1.682237 0.782325
C  -2.907936 -2.35036 0.185196
C  -3.52025 0.039369 -0.128524
C  -0.687011 -3.007412 0.822999
C  -1.998576 -3.337417 0.524815
C  -0.732853 0.737107 0.259461
C  -4.42343 -0.12044 -1.305176
C  1.849501 -0.80019 0.312714
C  2.354617 -0.053243 -1.732396
C  3.799105 0.258231 0.087722
C  3.547123 0.472515 -1.26158
C  0.47584 2.493592 1.244635
C  -4.132996 3.106356 1.291027
C  0.841427 -0.418921 -3.52173
C  5.220855 0.530639 1.963527
H  -3.935176 -2.619622 -0.020382
H  0.032171 -3.770983 1.088135
H  -2.313467 -4.371168 0.562365
H  -5.206566 0.630884 -1.352089
H  -4.89714 -1.101668 -1.299193
H  -3.833239 -0.061053 -2.22189
H  4.235416 1.007856 -1.899793
H  -0.292934 3.256037 1.117682
H  1.194351 2.555871 0.426827
H  0.98847 2.651435 2.188769
H  -3.139991 3.539882 1.148706
H  -4.882372 3.855938 1.044487
H  -4.250451 2.818788 2.337676
H  -0.024449 0.010225 -3.019314
H  0.805244 -1.505045 -3.439998
H  0.818008 -0.140035 -4.571676
H  5.283092 -0.527024 2.218773
H  6.189403 0.994316 2.129854
H  4.479246 1.012686 2.600164
elementType: O N C H
totalener: -1274.93136425 hartree
nucrepener: 2490.14935609 hartree
electener: -3765.08072034 hartree
oneelecener: -6692.98596521 hartree
twoeener: 2927.90524487 hartree
cpcmener: -0.04034812 hartree
kineticenergy: 1269.75086896 hartree
xcener: -119.065308969429 hartree
chargesum: 0.0000000
charge: -0.302695 -0.267161 -0.459984 -0.254501 -0.300821 -0.301523 -0.157262 -0.398846 -0.399905 -0.001696 0.020669 0.207486 -0.138622 0.156962 -0.181611 -0.133333 0.394146 -0.240354 0.351569 0.415381 0.436067 -0.323614 -0.138707 -0.103967 -0.112047 -0.115268 0.152336 0.152281 0.164363 0.101660 0.108536 0.111888 0.141945 0.130607 0.118403 0.134937 0.099645 0.118912 0.102916 0.106189 0.114111 0.133016 0.112985 0.131739 0.113168
qa: -0.3027 -0.2672 -0.4600 -0.2545 -0.3008 -0.3015 -0.1573 -0.3988 -0.3999 -0.0017 0.0207 0.2075 -0.1386 0.1570 -0.1816 -0.1333 0.3941 -0.2404 0.3516 0.4154 0.4361 -0.3236 -0.1387 -0.1040 -0.1120 -0.1153 0.1523 0.1523 0.1644 0.1017 0.1085 0.1119 0.1419 0.1306 0.1184 0.1349 0.0996 0.1189 0.1029 0.1062 0.1141 0.1330 0.1130 0.1317 0.1132
va: 2.0943 2.1381 2.0124 1.9244 2.1178 2.1179 2.8476 2.9084 2.9286 3.7628 3.6355 3.7685 3.8869 3.8094 4.0041 3.9151 4.0953 3.9251 4.3193 4.0144 3.9730 3.9266 3.8641 3.8915 3.8426 3.8491 0.9969 1.0008 0.9878 1.0229 1.0042 1.0009 1.0177 0.9906 0.9910 0.9943 0.9884 0.9942 0.9958 1.0025 0.9956 0.9945 0.9962 0.9935 0.9957
dispcorr: -0.023821992 hartree
energy: -1274.955186246353
dipole: -7.94210 7.76034 -0.18176 7.71807 -8.16169 -0.44362 -1.12707 1.14874 0.02168
magnitude: 0.47990 au
magnitude: 1.21980 debye
