program: Orca
programVersion: 5.0.2
elementType: O O O O O O N N N C C C C C C C C C C C C C C C C C H H H H H H H H H H H H H H H H H H H
charge: 0
multiplicity: 1
keywords: wb97x-d3
keywords: def2-TZVPP
keywords: def2/J RIJCOSX
keywords: DEFGRID2
keywords: scfconv7
keywords: smallprint printgap noloewdin
keywords: NOSOSCF
formula: C17H19N3O6
InChI: InChI=1/C17H19N3O6/c1-10(20-25-5)11-7-6-8-12(15(11)16(21)24-4)26-17-18-13(22-2)9-14(19-17)23-3/h6-9H,1-5H3
45 atoms
O  0.468865 -0.906386 -1.272606
O  -1.84665 0.99962 -1.492657
O  -0.72274 1.795042 0.270397
O  -4.596639 1.691473 1.440703
O  4.420002 0.667287 -2.766955
O  3.924445 -0.492009 1.698737
N  -3.594343 0.909907 0.966826
N  2.407782 -0.12502 -2.015319
N  2.153462 -0.704571 0.262205
C  -2.226902 -0.953403 1.183024
C  -1.323724 -0.509597 0.207961
C  -0.364052 -1.379104 -0.279485
C  -2.121463 -2.267122 1.63276
C  -3.295234 -0.080794 1.711829
C  -0.26771 -2.688054 0.159346
C  -1.158186 -3.125322 1.123259
C  -1.284136 0.895706 -0.305572
C  -3.942522 -0.421046 3.014161
C  1.737449 -0.566725 -0.973733
C  3.668392 0.212572 -1.77641
C  3.421273 -0.369368 0.480437
C  4.252768 0.10692 -0.520854
C  -1.871455 2.297899 -2.092594
C  -4.78954 2.808514 0.589482
C  3.846978 0.807933 -4.064272
C  3.100862 -1.009777 2.74144
H  -2.809401 -2.639763 2.378911
H  0.488155 -3.347732 -0.245977
H  -1.104253 -4.143769 1.482704
H  -4.445524 0.433383 3.458239
H  -3.204078 -0.786862 3.725702
H  -4.685156 -1.210272 2.881443
H  5.282742 0.37644 -0.338122
H  -0.86441 2.667633 -2.281716
H  -2.410325 3.010453 -1.467661
H  -2.393999 2.178461 -3.036418
H  -5.628699 3.363125 1.005411
H  -3.912157 3.458457 0.568843
H  -5.036339 2.502318 -0.429106
H  4.64428 1.188892 -4.696677
H  3.021082 1.518704 -4.065198
H  3.502787 -0.146511 -4.460695
H  2.735934 -2.009997 2.510126
H  3.738894 -1.058597 3.619536
H  2.255218 -0.355229 2.94989
elementType: O N C H
totalener: -1274.93336646 hartree
nucrepener: 2423.06482199 hartree
electener: -3697.99818845 hartree
oneelecener: -6559.03769455 hartree
twoeener: 2861.03950610 hartree
cpcmener: -0.04317803 hartree
kineticenergy: 1269.75232187 hartree
xcener: -119.066747788688 hartree
chargesum: -0.0000000
charge: -0.310377 -0.271917 -0.463151 -0.263956 -0.303072 -0.303103 -0.134366 -0.410246 -0.414778 0.038867 -0.073852 0.256579 -0.175613 0.172001 -0.207856 -0.124396 0.445784 -0.251875 0.396889 0.425026 0.402816 -0.317834 -0.139066 -0.120919 -0.115006 -0.113423 0.153292 0.154171 0.164425 0.103043 0.108722 0.117967 0.143065 0.124508 0.115681 0.132473 0.126658 0.108809 0.107801 0.131379 0.114067 0.112393 0.111623 0.132405 0.114363
qa: -0.3104 -0.2719 -0.4632 -0.2640 -0.3031 -0.3031 -0.1344 -0.4102 -0.4148 0.0389 -0.0739 0.2566 -0.1756 0.1720 -0.2079 -0.1244 0.4458 -0.2519 0.3969 0.4250 0.4028 -0.3178 -0.1391 -0.1209 -0.1150 -0.1134 0.1533 0.1542 0.1644 0.1030 0.1087 0.1180 0.1431 0.1245 0.1157 0.1325 0.1267 0.1088 0.1078 0.1314 0.1141 0.1124 0.1116 0.1324 0.1144
va: 2.0878 2.1189 2.0261 1.9378 2.1152 2.1167 2.8576 2.9451 2.9205 3.7973 3.8018 3.7168 3.9230 3.8266 4.0250 3.9072 4.1656 3.9350 4.2497 3.9964 4.0402 3.9244 3.8685 3.8871 3.8484 3.8486 0.9955 0.9993 0.9882 1.0212 0.9989 0.9957 1.0167 0.9947 0.9912 0.9944 0.9940 0.9899 0.9915 0.9934 0.9956 0.9963 0.9936 0.9943 0.9949
dispcorr: -0.021536828 hartree
energy: -1274.954903288747
dipole: -10.00480 9.29025 -0.71454 5.17859 -6.09956 -0.92097 3.66974 -3.32965 0.34009
magnitude: 1.21425 au
magnitude: 3.08639 debye
