program: Orca
programVersion: 5.0.2
elementType: O O O O O O N N N C C C C C C C C C C C C C C C C C H H H H H H H H H H H H H H H H H H H
charge: 0
multiplicity: 1
keywords: wb97x-d3
keywords: def2-TZVPP
keywords: def2/J RIJCOSX
keywords: DEFGRID2
keywords: scfconv7
keywords: smallprint printgap noloewdin
keywords: NOSOSCF
formula: C17H19N3O6
InChI: InChI=1/C17H19N3O6/c1-10(20-25-5)11-7-6-8-12(15(11)16(21)24-4)26-17-18-13(22-2)9-14(19-17)23-3/h6-9H,1-5H3
45 atoms
O  1.168499 -1.697797 1.002335
O  -0.787856 1.592324 0.092282
O  0.446232 0.939346 1.835655
O  -4.896315 1.569564 -0.362204
O  1.947367 0.787217 -2.755117
O  5.25497 0.12735 0.431694
N  -4.033517 0.515059 -0.466981
N  1.514345 -0.493794 -0.906714
N  3.19246 -0.821519 0.724398
C  -2.361133 -0.763328 0.519467
C  -0.987007 -0.62691 0.747942
C  -0.180274 -1.763767 0.736869
C  -2.892427 -2.029756 0.294972
C  -3.27536 0.404084 0.551827
C  -0.711215 -3.018012 0.500225
C  -2.073519 -3.146629 0.287189
C  -0.361415 0.705078 0.96841
C  -3.320327 1.29695 1.752069
C  1.985276 -0.960829 0.22513
C  2.35195 0.261459 -1.610366
C  4.019591 -0.075444 0.002233
C  3.649447 0.51962 -1.19691
C  -0.251384 2.915888 0.172798
C  -5.692473 1.664176 -1.528552
C  0.614002 0.542256 -3.198067
C  5.654789 -0.433476 1.679701
H  -3.957606 -2.140779 0.147019
H  -0.061388 -3.882912 0.489003
H  -2.498578 -4.125823 0.113507
H  -2.581019 1.012493 2.497134
H  -4.29968 1.225541 2.230045
H  -3.167589 2.344657 1.490796
H  4.326566 1.13749 -1.768684
H  -0.735106 3.479302 -0.618868
H  0.825863 2.908855 0.006639
H  -0.472762 3.376719 1.134877
H  -6.300771 0.769669 -1.679178
H  -6.352316 2.516382 -1.377882
H  -5.087605 1.839964 -2.420561
H  0.436053 -0.518116 -3.374337
H  0.513803 1.080988 -4.136121
H  -0.121994 0.919051 -2.48898
H  5.040408 -0.067824 2.502032
H  5.623704 -1.522529 1.662088
H  6.680977 -0.109688 1.830492
elementType: O N C H
totalener: -1274.93346232 hartree
nucrepener: 2473.00890254 hartree
electener: -3747.94236485 hartree
oneelecener: -6658.07056564 hartree
twoeener: 2910.12820079 hartree
cpcmener: -0.04070338 hartree
kineticenergy: 1269.74049648 hartree
xcener: -119.061983328200 hartree
chargesum: -0.0000000
charge: -0.300564 -0.262936 -0.447979 -0.248834 -0.301984 -0.302323 -0.176666 -0.399475 -0.402065 0.082713 -0.015570 0.220357 -0.201185 0.156110 -0.188815 -0.121755 0.404092 -0.268669 0.361833 0.408702 0.438258 -0.325419 -0.135525 -0.110821 -0.111138 -0.115393 0.145318 0.152315 0.164287 0.103115 0.122894 0.108253 0.142430 0.132961 0.127660 0.131151 0.102590 0.116458 0.103208 0.115594 0.134033 0.104190 0.113940 0.113203 0.131452
qa: -0.3006 -0.2629 -0.4480 -0.2488 -0.3020 -0.3023 -0.1767 -0.3995 -0.4021 0.0827 -0.0156 0.2204 -0.2012 0.1561 -0.1888 -0.1218 0.4041 -0.2687 0.3618 0.4087 0.4383 -0.3254 -0.1355 -0.1108 -0.1111 -0.1154 0.1453 0.1523 0.1643 0.1031 0.1229 0.1083 0.1424 0.1330 0.1277 0.1312 0.1026 0.1165 0.1032 0.1156 0.1340 0.1042 0.1139 0.1132 0.1315
va: 2.0968 2.1171 2.0478 1.9371 2.1104 2.1175 2.8301 2.9043 2.9471 3.6603 3.6043 3.7443 3.9698 3.7431 4.0118 3.9175 4.0595 3.9559 4.3039 4.0112 3.9819 3.9345 3.8328 3.8928 3.8437 3.8467 1.0140 1.0008 0.9875 1.0112 1.0012 1.0035 1.0175 0.9926 0.9928 0.9942 0.9940 0.9935 0.9943 0.9969 0.9942 0.9955 0.9966 0.9958 0.9935
dispcorr: -0.023697435 hartree
energy: -1274.957159752879
dipole: -11.44733 10.39016 -1.05717 9.75169 -9.24519 0.50650 -3.62257 2.61557 -1.00701
magnitude: 1.54538 au
magnitude: 3.92806 debye
