program: Orca
programVersion: 5.0.2
elementType: O O O O O O N N N C C C C C C C C C C C C C C C C C H H H H H H H H H H H H H H H H H H H
charge: 0
multiplicity: 1
keywords: wb97x-d3
keywords: def2-TZVPP
keywords: def2/J RIJCOSX
keywords: DEFGRID2
keywords: scfconv7
keywords: smallprint printgap noloewdin
keywords: NOSOSCF
formula: C17H19N3O6
InChI: InChI=1/C17H19N3O6/c1-10(20-25-5)11-7-6-8-12(15(11)16(21)24-4)26-17-18-13(22-2)9-14(19-17)23-3/h6-9H,1-5H3
45 atoms
O  1.163265 -0.907807 0.992739
O  -1.440529 1.699833 1.831083
O  0.340484 1.745743 0.482744
O  -5.488533 1.169367 0.635696
O  2.716093 -0.952176 -3.297693
O  5.447558 0.270309 0.252354
N  -4.51589 0.224675 0.762893
N  1.884415 -0.928448 -1.170742
N  3.275149 -0.320617 0.6380
C  -2.38025 -0.495645 0.211633
C  -1.052845 -0.190537 0.541525
C  -0.102378 -1.204675 0.550911
C  -2.708264 -1.808766 -0.108541
C  -3.439879 0.540837 0.16056
C  -0.435668 -2.511665 0.244821
C  -1.745706 -2.806613 -0.087878
C  -0.626738 1.182853 0.930377
C  -3.247864 1.798561 -0.629329
C  2.142979 -0.709854 0.096506
C  2.899063 -0.73925 -2.00645
C  4.275435 -0.127686 -0.21113
C  4.152843 -0.326791 -1.580821
C  -1.189067 3.039207 2.262691
C  -6.650487 0.762812 1.331232
C  1.444807 -1.417907 -3.742478
C  5.590616 0.500207 1.650063
H  -3.725035 -2.050157 -0.386774
H  0.318655 -3.286949 0.277938
H  -2.019953 -3.823296 -0.335857
H  -3.392519 2.692644 -0.020861
H  -3.981177 1.844653 -1.437876
H  -2.263748 1.847473 -1.090401
H  4.975759 -0.173226 -2.263896
H  -0.235509 3.109965 2.786272
H  -1.994956 3.285757 2.947862
H  -1.197048 3.738677 1.426799
H  -7.388074 1.549592 1.180591
H  -7.051009 -0.175478 0.939706
H  -6.466279 0.652663 2.40269
H  1.536657 -1.535244 -4.819431
H  0.651612 -0.702179 -3.525448
H  1.189663 -2.380623 -3.298454
H  5.4042 -0.402872 2.231776
H  6.623442 0.808901 1.792029
H  4.929218 1.293807 1.999009
elementType: O N C H
totalener: -1274.93774633 hartree
nucrepener: 2399.74350071 hartree
electener: -3674.68124704 hartree
oneelecener: -6511.69174333 hartree
twoeener: 2837.01049629 hartree
cpcmener: -0.03418567 hartree
kineticenergy: 1269.77009371 hartree
xcener: -119.063253024705 hartree
chargesum: -0.0000000
charge: -0.304565 -0.261283 -0.434238 -0.236286 -0.295659 -0.294973 -0.169495 -0.413301 -0.401562 0.096265 -0.090899 0.312023 -0.212970 0.173974 -0.211585 -0.105054 0.390185 -0.273284 0.383700 0.398940 0.422956 -0.322780 -0.135673 -0.110382 -0.113910 -0.114005 0.141445 0.147817 0.160070 0.107136 0.120836 0.104390 0.140331 0.128771 0.131238 0.119282 0.113480 0.100960 0.102279 0.130612 0.112426 0.110909 0.110600 0.128615 0.112663
qa: -0.3046 -0.2613 -0.4342 -0.2363 -0.2957 -0.2950 -0.1695 -0.4133 -0.4016 0.0963 -0.0909 0.3120 -0.2130 0.1740 -0.2116 -0.1051 0.3902 -0.2733 0.3837 0.3989 0.4230 -0.3228 -0.1357 -0.1104 -0.1139 -0.1140 0.1414 0.1478 0.1601 0.1071 0.1208 0.1044 0.1403 0.1288 0.1312 0.1193 0.1135 0.1010 0.1023 0.1306 0.1124 0.1109 0.1106 0.1286 0.1127
va: 2.0986 2.1448 2.0639 1.9482 2.1249 2.1238 2.8492 2.9061 2.9447 3.6561 3.7882 3.6723 3.9930 3.7210 4.0124 3.9036 4.1439 3.9550 4.2676 4.0494 4.0012 3.9208 3.8529 3.8971 3.8534 3.8521 1.0175 1.0032 0.9887 1.0035 1.0026 1.0102 1.0175 0.9936 0.9936 0.9924 0.9938 0.9943 0.9947 0.9943 0.9951 0.9941 0.9973 0.9935 0.9969
dispcorr: -0.021248370 hartree
energy: -1274.958994700779
dipole: -13.25621 12.12397 -1.13224 6.63041 -6.73534 -0.10493 0.08832 -0.33370 -0.24538
magnitude: 1.16326 au
magnitude: 2.95678 debye
