program: Orca
programVersion: 5.0.2
elementType: O O O O O O N N N C C C C C C C C C C C C C C C C C H H H H H H H H H H H H H H H H H H H
charge: 0
multiplicity: 1
keywords: wb97x-d3
keywords: def2-TZVPP
keywords: def2/J RIJCOSX
keywords: DEFGRID2
keywords: scfconv7
keywords: smallprint printgap noloewdin
keywords: NOSOSCF
formula: C17H19N3O6
InChI: InChI=1/C17H19N3O6/c1-10(20-25-5)11-7-6-8-12(15(11)16(21)24-4)26-17-18-13(22-2)9-14(19-17)23-3/h6-9H,1-5H3
45 atoms
O  1.165536 -0.923935 1.007188
O  -1.446162 1.698358 1.812301
O  0.350663 1.726862 0.484741
O  -5.477286 1.174894 0.61322
O  2.68743 -0.892018 -3.294187
O  5.449755 0.251721 0.258325
N  -4.509783 0.224714 0.75182
N  1.871923 -0.907628 -1.161114
N  3.277268 -0.336857 0.648153
C  -2.376134 -0.511105 0.212189
C  -1.049786 -0.204653 0.544589
C  -0.100906 -1.219953 0.565138
C  -2.705611 -1.826464 -0.09689
C  -3.432158 0.528128 0.146223
C  -0.434998 -2.528762 0.268053
C  -1.744544 -2.825384 -0.065241
C  -0.624766 1.171478 0.923498
C  -3.232464 1.773535 -0.66127
C  2.140022 -0.712554 0.107942
C  2.881167 -0.705568 -2.000043
C  4.272505 -0.132624 -0.203953
C  4.139459 -0.305768 -1.57621
C  -1.195701 3.041121 2.232955
C  -6.642903 0.782482 1.310558
C  1.409884 -1.338797 -3.738089
C  5.603549 0.45549 1.658894
H  -3.722368 -2.067313 -0.375732
H  0.319427 -3.303639 0.308768
H  -2.01928 -3.843764 -0.305667
H  -2.247295 1.810011 -1.120985
H  -3.373732 2.676832 -0.06617
H  -3.963867 1.811195 -1.471843
H  4.957464 -0.142005 -2.262733
H  -2.00513 3.295035 2.911242
H  -1.19884 3.732609 1.390386
H  -0.244906 3.116675 2.760808
H  -7.375258 1.572253 1.150551
H  -7.048484 -0.157448 0.928133
H  -6.461305 0.682001 2.383536
H  1.491646 -1.434227 -4.818045
H  0.623563 -0.621946 -3.500196
H  1.150146 -2.308535 -3.312363
H  4.946809 1.24412 2.027268
H  5.419137 -0.45776 2.225185
H  6.638216 0.758812 1.79904
elementType: O N C H
totalener: -1274.93782743 hartree
nucrepener: 2401.78956242 hartree
electener: -3676.72738986 hartree
oneelecener: -6515.78725833 hartree
twoeener: 2839.05986848 hartree
cpcmener: -0.03416983 hartree
kineticenergy: 1269.77113340 hartree
xcener: -119.063402873704 hartree
chargesum: 0.0000000
charge: -0.305054 -0.261619 -0.434286 -0.236742 -0.295827 -0.295047 -0.169560 -0.413537 -0.401235 0.095694 -0.092786 0.311220 -0.212384 0.174639 -0.209473 -0.105805 0.392308 -0.273393 0.384332 0.398641 0.423139 -0.322719 -0.135506 -0.110417 -0.113768 -0.114162 0.141489 0.148349 0.160125 0.104275 0.107116 0.121014 0.140317 0.131198 0.119256 0.128389 0.113552 0.100933 0.102145 0.130431 0.112069 0.110722 0.112726 0.110647 0.128596
qa: -0.3051 -0.2616 -0.4343 -0.2367 -0.2958 -0.2950 -0.1696 -0.4135 -0.4012 0.0957 -0.0928 0.3112 -0.2124 0.1746 -0.2095 -0.1058 0.3923 -0.2734 0.3843 0.3986 0.4231 -0.3227 -0.1355 -0.1104 -0.1138 -0.1142 0.1415 0.1483 0.1601 0.1043 0.1071 0.1210 0.1403 0.1312 0.1193 0.1284 0.1136 0.1009 0.1021 0.1304 0.1121 0.1107 0.1127 0.1106 0.1286
va: 2.0982 2.1447 2.0641 1.9476 2.1245 2.1237 2.8485 2.9031 2.9448 3.6553 3.7842 3.6744 3.9917 3.7214 4.0163 3.9049 4.1413 3.9548 4.2648 4.0491 4.0012 3.9210 3.8532 3.8972 3.8546 3.8522 1.0174 1.0025 0.9887 1.0101 1.0035 1.0025 1.0176 0.9936 0.9923 0.9937 0.9938 0.9942 0.9947 0.9944 0.9950 0.9941 0.9968 0.9973 0.9935
dispcorr: -0.021289781 hartree
energy: -1274.959117215895
dipole: -13.25965 12.11936 -1.14030 6.70658 -6.79733 -0.09075 -0.05168 -0.21253 -0.26420
magnitude: 1.17402 au
magnitude: 2.98411 debye
