program: Orca
programVersion: 5.0.2
elementType: O O O O O O N N N C C C C C C C C C C C C C C C C C H H H H H H H H H H H H H H H H H H H
charge: 0
multiplicity: 1
keywords: wb97x-d3
keywords: def2-TZVPP
keywords: def2/J RIJCOSX
keywords: DEFGRID2
keywords: scfconv7
keywords: smallprint printgap noloewdin
keywords: NOSOSCF
formula: C17H19N3O6
InChI: InChI=1/C17H19N3O6/c1-10(20-25-5)11-7-6-8-12(15(11)16(21)24-4)26-17-18-13(22-2)9-14(19-17)23-3/h6-9H,1-5H3
45 atoms
O  1.163734 0.822012 0.938812
O  -0.350532 1.020877 -1.372924
O  -2.052903 2.095191 -0.40222
O  -5.730957 -0.041992 0.669864
O  4.975847 1.481392 -1.37607
O  2.989834 -2.717014 -1.282461
N  -4.523987 -0.126493 1.297897
N  3.042038 1.161298 -0.201221
N  2.033202 -0.97259 -0.165132
C  -2.238618 -0.488106 1.138509
C  -1.11159 0.201839 0.676187
C  0.105725 0.031157 1.321672
C  -2.10134 -1.352342 2.219205
C  -3.562538 -0.333535 0.489696
C  0.238066 -0.821817 2.402619
C  -0.874067 -1.51706 2.843882
C  -1.233727 1.211816 -0.411963
C  -3.716978 -0.502311 -0.990635
C  2.117524 0.296717 0.15247
C  4.008483 0.676967 -0.970098
C  3.010368 -1.442867 -0.930388
C  4.056785 -0.650806 -1.378177
C  -0.291122 1.993384 -2.418787
C  -6.753251 0.190227 1.618938
C  4.947225 2.848742 -0.980404
C  1.915629 -3.532101 -0.823057
H  -2.96152 -1.908578 2.566242
H  1.195837 -0.929687 2.894704
H  -0.783903 -2.194124 3.682838
H  -4.403774 -1.325178 -1.200303
H  -2.771894 -0.743214 -1.472449
H  -4.131652 0.387662 -1.465297
H  4.85196 -1.036907 -1.99955
H  -1.230756 2.046376 -2.968433
H  0.498717 1.661925 -3.086742
H  -0.041127 2.978975 -2.025891
H  -6.595681 1.122319 2.167211
H  -7.68193 0.266651 1.055649
H  -6.839847 -0.632807 2.332901
H  5.821734 3.304389 -1.438387
H  5.012942 2.959182 0.102367
H  4.050729 3.355438 -1.338749
H  2.104316 -4.523072 -1.228515
H  1.887742 -3.590347 0.265625
H  0.951861 -3.173563 -1.185486
elementType: O N C H
totalener: -1274.93759506 hartree
nucrepener: 2413.70526492 hartree
electener: -3688.64285997 hartree
oneelecener: -6538.97742479 hartree
twoeener: 2850.33456481 hartree
cpcmener: -0.03371256 hartree
kineticenergy: 1269.77337326 hartree
xcener: -119.063021295633 hartree
chargesum: -0.0000000
charge: -0.306965 -0.271789 -0.423222 -0.236155 -0.294070 -0.295668 -0.168944 -0.401135 -0.410421 0.113150 -0.062463 0.285991 -0.210847 0.151482 -0.209080 -0.107355 0.386861 -0.271162 0.384340 0.424670 0.396147 -0.321201 -0.135853 -0.110536 -0.115299 -0.113879 0.142290 0.148295 0.160615 0.116925 0.100376 0.114346 0.140812 0.125824 0.125308 0.124892 0.102314 0.113485 0.101380 0.128857 0.111979 0.111969 0.130924 0.110937 0.111877
qa: -0.3070 -0.2718 -0.4232 -0.2362 -0.2941 -0.2957 -0.1689 -0.4011 -0.4104 0.1131 -0.0625 0.2860 -0.2108 0.1515 -0.2091 -0.1074 0.3869 -0.2712 0.3843 0.4247 0.3961 -0.3212 -0.1359 -0.1105 -0.1153 -0.1139 0.1423 0.1483 0.1606 0.1169 0.1004 0.1143 0.1408 0.1258 0.1253 0.1249 0.1023 0.1135 0.1014 0.1289 0.1120 0.1120 0.1309 0.1109 0.1119
va: 2.0946 2.1327 2.0830 1.9522 2.1242 2.1252 2.8526 2.9350 2.8952 3.6539 3.7572 3.7213 3.9831 3.7345 4.0182 3.9009 4.1545 3.9479 4.2512 3.9932 4.0498 3.9205 3.8623 3.8968 3.8543 3.8545 1.0175 1.0022 0.9885 1.0033 1.0111 1.0054 1.0175 0.9934 0.9948 0.9919 0.9954 0.9937 0.9936 0.9935 0.9966 0.9961 0.9944 0.9936 0.9955
dispcorr: -0.021760245 hartree
energy: -1274.959355303590
dipole: -10.09979 10.78332 0.68353 -1.96809 0.67305 -1.29504 -4.65795 4.01251 -0.64545
magnitude: 1.60030 au
magnitude: 4.06763 debye
