program: Orca
programVersion: 5.0.2
elementType: O O O O O O N N N C C C C C C C C C C C C C C C C C H H H H H H H H H H H H H H H H H H H
charge: 0
multiplicity: 1
keywords: wb97x-d3
keywords: def2-TZVPP
keywords: def2/J RIJCOSX
keywords: DEFGRID2
keywords: scfconv7
keywords: smallprint printgap noloewdin
keywords: NOSOSCF
formula: C17H19N3O6
InChI: InChI=1/C17H19N3O6/c1-10(20-25-5)11-7-6-8-12(15(11)16(21)24-4)26-17-18-13(22-2)9-14(19-17)23-3/h6-9H,1-5H3
45 atoms
O  0.533844 -1.180784 -1.225564
O  -2.396841 0.727795 -1.40846
O  -0.492504 1.514328 -0.536869
O  -3.993441 2.041185 1.859788
O  4.411136 0.471405 -2.818992
O  3.762288 0.048942 1.759552
N  -3.016253 1.198702 1.439909
N  2.441465 -0.367044 -2.020464
N  2.111766 -0.576275 0.308195
C  -2.247711 -0.970099 1.12783
C  -1.310711 -0.618261 0.147385
C  -0.30775 -1.513621 -0.18921
C  -2.138099 -2.217264 1.737675
C  -3.306327 -0.035779 1.563078
C  -0.205268 -2.754592 0.413071
C  -1.129811 -3.099772 1.382791
C  -1.351551 0.673362 -0.604081
C  -4.584803 -0.571552 2.125092
C  1.750902 -0.683744 -0.948172
C  3.651817 0.124804 -1.793628
C  3.327873 -0.085206 0.517667
C  4.170505 0.295631 -0.515725
C  -2.576736 1.922849 -2.168107
C  -3.599991 3.384832 1.654485
C  3.897691 0.312535 -4.137887
C  2.907146 -0.339974 2.829082
H  -2.841764 -2.505963 2.506958
H  0.576551 -3.441471 0.116247
H  -1.063918 -4.063889 1.868884
H  -5.423223 0.090704 1.917384
H  -4.518538 -0.681375 3.210198
H  -4.816773 -1.549251 1.70758
H  5.15875 0.695495 -0.340309
H  -1.744607 2.09224 -2.851697
H  -2.696229 2.791513 -1.519863
H  -3.487341 1.776455 -2.742508
H  -4.421942 4.00061 2.015083
H  -2.697032 3.633605 2.216523
H  -3.433259 3.602688 0.596615
H  3.673133 -0.730471 -4.362938
H  4.684751 0.659133 -4.803122
H  3.002714 0.914056 -4.299343
H  3.472109 -0.153816 3.739281
H  1.990209 0.250129 2.850066
H  2.649593 -1.398435 2.778692
elementType: O N C H
totalener: -1274.93815869 hartree
nucrepener: 2430.18285388 hartree
electener: -3705.12101257 hartree
oneelecener: -6573.27691755 hartree
twoeener: 2868.15590498 hartree
cpcmener: -0.03630851 hartree
kineticenergy: 1269.77461474 hartree
xcener: -119.068187811951 hartree
chargesum: 0.0000000
charge: -0.306144 -0.264327 -0.435689 -0.245909 -0.295299 -0.295488 -0.148505 -0.402288 -0.410038 0.047536 -0.075228 0.298190 -0.184241 0.179152 -0.204156 -0.120330 0.392639 -0.272130 0.382745 0.423191 0.397344 -0.319314 -0.132200 -0.111666 -0.114781 -0.115005 0.151427 0.150200 0.160109 0.104661 0.120544 0.104826 0.140564 0.123034 0.115023 0.129561 0.119938 0.106465 0.099716 0.110811 0.128877 0.112641 0.129481 0.113763 0.110301
qa: -0.3061 -0.2643 -0.4357 -0.2459 -0.2953 -0.2955 -0.1485 -0.4023 -0.4100 0.0475 -0.0752 0.2982 -0.1842 0.1792 -0.2042 -0.1203 0.3926 -0.2721 0.3827 0.4232 0.3973 -0.3193 -0.1322 -0.1117 -0.1148 -0.1150 0.1514 0.1502 0.1601 0.1047 0.1205 0.1048 0.1406 0.1230 0.1150 0.1296 0.1199 0.1065 0.0997 0.1108 0.1289 0.1126 0.1295 0.1138 0.1103
va: 2.0938 2.1253 2.0664 1.9482 2.1237 2.1246 2.8538 2.9476 2.9007 3.7947 3.8169 3.6800 3.9365 3.7650 4.0373 3.9098 4.2095 3.9447 4.2595 4.0003 4.0490 3.9195 3.8602 3.9030 3.8526 3.8552 0.9957 1.0003 0.9897 1.0155 0.9947 1.0013 1.0174 0.9951 0.9882 0.9945 0.9935 0.9951 0.9820 0.9970 0.9935 0.9967 0.9946 0.9950 0.9938
dispcorr: -0.021468880 hartree
energy: -1274.959627564948
dipole: -11.26356 9.97552 -1.28803 5.99505 -6.72393 -0.72887 4.25129 -3.63848 0.61281
magnitude: 1.60182 au
magnitude: 4.07150 debye
