program: Orca
programVersion: 5.0.2
elementType: O O O O O O N N N C C C C C C C C C C C C C C C C C H H H H H H H H H H H H H H H H H H H
charge: 0
multiplicity: 1
keywords: wb97x-d3
keywords: def2-TZVPP
keywords: def2/J RIJCOSX
keywords: DEFGRID2
keywords: scfconv7
keywords: smallprint printgap noloewdin
keywords: NOSOSCF
formula: C17H19N3O6
InChI: InChI=1/C17H19N3O6/c1-10(20-25-5)11-7-6-8-12(15(11)16(21)24-4)26-17-18-13(22-2)9-14(19-17)23-3/h6-9H,1-5H3
45 atoms
O  0.471165 -1.012081 -1.318771
O  -0.676732 1.536652 -0.226787
O  -2.280262 0.839811 -1.623571
O  -4.378293 1.746121 1.645876
O  4.38585 0.679197 -2.773132
O  3.742805 -0.160703 1.748544
N  -3.332435 0.985921 1.238425
N  2.395555 -0.173351 -2.044437
N  2.068046 -0.590023 0.256117
C  -2.364221 -1.10561 0.967227
C  -1.423654 -0.649421 0.034265
C  -0.364044 -1.464793 -0.322314
C  -2.185455 -2.369557 1.523136
C  -3.502246 -0.266496 1.39602
C  -0.193659 -2.725222 0.223608
C  -1.11281 -3.168697 1.156683
C  -1.544142 0.655957 -0.689821
C  -4.719186 -0.90452 1.985924
C  1.701992 -0.574377 -1.002626
C  3.622379 0.256147 -1.780486
C  3.301436 -0.163213 0.50276
C  4.152953 0.283907 -0.49623
C  -0.663468 2.826493 -0.839879
C  -4.148573 3.105178 1.323427
C  3.858341 0.67096 -4.096152
C  2.875956 -0.61922 2.782027
H  -2.884851 -2.740551 2.260061
H  0.636052 -3.348452 -0.083399
H  -0.995919 -4.146997 1.603136
H  -4.87587 -1.902509 1.58183
H  -5.61482 -0.318776 1.789023
H  -4.623028 -0.997485 3.07031
H  5.157064 0.626318 -0.291694
H  -0.410115 2.765383 -1.898347
H  0.102573 3.395264 -0.320184
H  -1.624778 3.328323 -0.723806
H  -3.241557 3.486892 1.797274
H  -4.087258 3.259795 0.24354
H  -5.005483 3.656081 1.70793
H  4.654336 1.050581 -4.731978
H  2.986928 1.320034 -4.187853
H  3.590767 -0.335042 -4.420478
H  3.454167 -0.553378 3.700348
H  1.988333 0.007685 2.87205
H  2.568209 -1.65364 2.625978
elementType: O N C H
totalener: -1274.93801180 hartree
nucrepener: 2436.68263279 hartree
electener: -3711.62064458 hartree
oneelecener: -6585.61640078 hartree
twoeener: 2873.99575620 hartree
cpcmener: -0.03556692 hartree
kineticenergy: 1269.78049329 hartree
xcener: -119.069595804924 hartree
chargesum: -0.0000000
charge: -0.304107 -0.266255 -0.431930 -0.251588 -0.294811 -0.294863 -0.140537 -0.403312 -0.409022 0.054512 -0.086186 0.276830 -0.182786 0.170902 -0.208855 -0.121528 0.420135 -0.261488 0.380636 0.422476 0.396685 -0.317029 -0.139035 -0.121170 -0.115518 -0.113746 0.149742 0.149804 0.159873 0.102911 0.103953 0.120734 0.140688 0.122141 0.129065 0.118686 0.106633 0.106394 0.123428 0.129215 0.112787 0.111743 0.130165 0.113858 0.109769
qa: -0.3041 -0.2663 -0.4319 -0.2516 -0.2948 -0.2949 -0.1405 -0.4033 -0.4090 0.0545 -0.0862 0.2768 -0.1828 0.1709 -0.2089 -0.1215 0.4201 -0.2615 0.3806 0.4225 0.3967 -0.3170 -0.1390 -0.1212 -0.1155 -0.1137 0.1497 0.1498 0.1599 0.1029 0.1040 0.1207 0.1407 0.1221 0.1291 0.1187 0.1066 0.1064 0.1234 0.1292 0.1128 0.1117 0.1302 0.1139 0.1098
va: 2.0960 2.1195 2.0715 1.9493 2.1246 2.1261 2.8603 2.9441 2.9033 3.7965 3.7944 3.7242 3.9307 3.8024 4.0320 3.9074 4.1878 3.9413 4.2598 3.9989 4.0494 3.9173 3.8662 3.8937 3.8526 3.8540 0.9965 1.0008 0.9899 1.0009 1.0169 0.9949 1.0174 0.9952 0.9950 0.9927 0.9921 0.9906 0.9946 0.9934 0.9961 0.9968 0.9944 0.9953 0.9936
dispcorr: -0.021939430 hartree
energy: -1274.959951225423
dipole: -7.45629 7.84696 0.39067 6.84970 -7.00860 -0.15890 6.63060 -5.06192 1.56869
magnitude: 1.62439 au
magnitude: 4.12888 debye
