program: Orca
programVersion: 5.0.2
elementType: O O O O O O N N N C C C C C C C C C C C C C C C C C H H H H H H H H H H H H H H H H H H H
charge: 0
multiplicity: 1
keywords: wb97x-d3
keywords: def2-TZVPP
keywords: def2/J RIJCOSX
keywords: DEFGRID2
keywords: scfconv7
keywords: smallprint printgap noloewdin
keywords: NOSOSCF
formula: C17H19N3O6
InChI: InChI=1/C17H19N3O6/c1-10(20-25-5)11-7-6-8-12(15(11)16(21)24-4)26-17-18-13(22-2)9-14(19-17)23-3/h6-9H,1-5H3
45 atoms
O  1.019192 -0.587736 1.33269
O  -0.552472 1.520367 -0.052397
O  -1.53392 1.512133 1.958536
O  -4.680789 1.425107 -0.462364
O  4.936117 1.405155 0.346216
O  2.738683 -1.134666 -2.862065
N  -3.538321 0.743424 -0.204367
N  2.949757 0.398925 0.853517
N  1.827442 -0.880306 -0.782895
C  -2.472458 -1.19411 0.48878
C  -1.267442 -0.53688 0.766768
C  -0.116508 -1.277266 0.971577
C  -2.468367 -2.584692 0.419789
C  -3.716863 -0.443358 0.22253
C  -0.114146 -2.659476 0.907942
C  -1.30338 -3.308247 0.627806
C  -1.167139 0.944364 0.962929
C  -5.044362 -1.098135 0.433349
C  1.968776 -0.354251 0.40983
C  3.915767 0.649164 -0.020464
C  2.807286 -0.627549 -1.64366
C  3.908253 0.150471 -1.317634
C  -0.359759 2.933863 0.014152
C  -4.377061 2.76593 -0.800601
C  4.954678 1.938678 1.666903
C  1.620101 -1.948895 -3.203719
H  -3.382006 -3.117299 0.19221
H  0.797638 -3.214492 1.085552
H  -1.325068 -4.388074 0.568731
H  -4.991363 -1.847673 1.220366
H  -5.381016 -1.598263 -0.477874
H  -5.809856 -0.375268 0.708885
H  4.702707 0.354388 -2.021153
H  -1.313122 3.459144 0.078074
H  0.139898 3.209786 -0.91027
H  0.268166 3.212006 0.860648
H  -5.327441 3.242747 -1.034033
H  -3.912545 3.29693 0.033745
H  -3.726255 2.825812 -1.67579
H  5.873116 2.516211 1.736718
H  4.968296 1.152415 2.422088
H  4.103518 2.595409 1.84959
H  0.682063 -1.397266 -3.136951
H  1.783332 -2.253177 -4.234649
H  1.558226 -2.836917 -2.573919
elementType: O N C H
totalener: -1274.93780941 hartree
nucrepener: 2444.43659745 hartree
electener: -3719.37440686 hartree
oneelecener: -6601.12777410 hartree
twoeener: 2881.75336724 hartree
cpcmener: -0.03545205 hartree
kineticenergy: 1269.78137010 hartree
xcener: -119.069498365089 hartree
chargesum: -0.0000000
charge: -0.305371 -0.267438 -0.432149 -0.251036 -0.294673 -0.294957 -0.142159 -0.400691 -0.407816 0.050252 -0.078739 0.280631 -0.184120 0.172965 -0.212590 -0.120905 0.420046 -0.263155 0.374590 0.423809 0.398947 -0.321010 -0.140006 -0.120769 -0.114034 -0.113522 0.150774 0.148714 0.160231 0.104086 0.120384 0.103674 0.140730 0.120016 0.129466 0.122412 0.123639 0.106355 0.106596 0.129194 0.111129 0.112207 0.112396 0.130839 0.111059
qa: -0.3054 -0.2674 -0.4321 -0.2510 -0.2947 -0.2950 -0.1422 -0.4007 -0.4078 0.0503 -0.0787 0.2806 -0.1841 0.1730 -0.2126 -0.1209 0.4200 -0.2632 0.3746 0.4238 0.3989 -0.3210 -0.1400 -0.1208 -0.1140 -0.1135 0.1508 0.1487 0.1602 0.1041 0.1204 0.1037 0.1407 0.1200 0.1295 0.1224 0.1236 0.1064 0.1066 0.1292 0.1111 0.1122 0.1124 0.1308 0.1111
va: 2.0970 2.1176 2.0720 1.9484 2.1248 2.1258 2.8590 2.9373 2.9051 3.7985 3.7946 3.7133 3.9311 3.7952 4.0285 3.9066 4.1844 3.9406 4.2677 3.9959 4.0491 3.9197 3.8648 3.8928 3.8541 3.8520 0.9962 1.0017 0.9897 1.0010 0.9950 1.0163 1.0174 0.9930 0.9946 0.9955 0.9946 0.9904 0.9927 0.9932 0.9971 0.9960 0.9958 0.9941 0.9938
dispcorr: -0.022187161 hartree
energy: -1274.959996567502
dipole: -9.56946 9.35014 -0.21932 4.85269 -5.56367 -0.71098 -5.36533 3.95928 -1.40606
magnitude: 1.59078 au
magnitude: 4.04345 debye
