program: Gaussian 09
title: 000073952
version: EM64L-G09RevD.01
frameworkgroup: C1[X(C16H24O4)]
method: RPBEPBE
basis: SDD
operation: Freq
keyword: #pfreq=noraman
keyword: PBEPBE/SDD
title: #p freq=noraman PBEPBE/SDD
converged: YES YES NO NO
title: Mulliken charges:
elementType: O O O O C C C C C C C C C C C C C C C C H H H H H H H H H H H H H H H H H H H H H H H H
charge: -0.285184 -0.285183 -0.247686 -0.247687 0.041150 0.041151 -0.445553 -0.433529 -0.445561 -0.433538 -0.397484 -0.400912 -0.397485 -0.400913 -0.388240 -0.388237 0.250499 0.250506 -0.284025 -0.284027 0.231454 0.231452 0.215423 0.208375 0.203879 0.237082 0.215424 0.208378 0.203879 0.237098 0.197948 0.207338 0.207116 0.200676 0.197948 0.207338 0.207117 0.200674 0.203911 0.192353 0.203911 0.192352 0.285405 0.285405
chargesum: 0.00000
title: Mulliken charges with hydrogens summed into heavy atoms:
elementType: O O O O C C C C C C C C C C C C C C C C
charge: -0.285184 -0.285183 -0.247686 -0.247687 0.272604 0.272603 -0.021755 0.007432 -0.021759 0.007439 0.007802 0.006880 0.007801 0.006878 0.008025 0.008026 0.250499 0.250506 0.001380 0.001378
polarizability: 2.96475767e+02 -5.82513894e+00 1.56931644e+02 1.43829300e-03 1.43944947e-03 1.37937377e+02
1716.lowfreq: -2.0592 -0.0014 -0.0009 0.0012 0.8233 8.9866 13.3510 28.5338 31.0030
frequency: 12.9638 28.5329 30.9581 47.9423 55.5667 72.4653 74.7106 114.2718 147.5633 158.2116 176.2328 197.0454 214.6723 218.0542 224.6827 275.8369 307.2767 324.4011 327.3460 344.6617 357.6721 429.8962 429.9681 437.2170 443.9319 458.2799 484.5723 549.6526 583.1036 612.5921 644.3379 723.4644 729.2663 786.2680 787.2684 791.1497 792.8731 833.4184 839.8923 871.7520 879.4773 885.0155 896.6506 897.2615 908.8765 920.5867 922.4901 922.8750 955.7749 967.8288 998.2097 999.8329 1013.9629 1044.3444 1044.5098 1052.2306 1052.2705 1083.2807 1083.3152 1109.1790 1109.2954 1129.2905 1133.6251 1152.3415 1152.3855 1198.1541 1198.2855 1241.4930 1241.4999 1252.9830 1252.9983 1258.3072 1259.8718 1273.0619 1285.4323 1303.2218 1305.2861 1309.7308 1309.7870 1331.8279 1331.8713 1337.5466 1338.7684 1340.1301 1340.1461 1346.9154 1346.9784 1362.4208 1363.4800 1463.8128 1463.8695 1464.2045 1464.2119 1466.3910 1466.4248 1472.8287 1472.8557 1480.8884 1480.9039 1603.5436 1608.2616 1659.1914 2971.5480 2971.6013 2972.2965 2972.3081 2974.1033 2974.1124 2987.9332 2987.9621 2990.1011 2990.1042 3008.6948 3008.7208 3034.9192 3035.0219 3037.2754 3037.2904 3045.7814 3045.7900 3057.3283 3057.3664 3065.9380 3065.9545 3159.5335 3163.5522
redmass: 4.4227 3.0909 4.8552 5.1269 5.2813 3.8966 7.2824 3.7046 5.2154 4.7234 2.7887 4.2564 2.0773 1.8133 2.6940 6.1967 4.0049 2.0896 1.9922 4.6550 4.9282 2.9203 2.9143 3.2829 2.6015 2.0682 1.7795 2.3129 3.4945 4.4394 6.5556 10.4159 7.5712 1.8358 1.6297 1.7143 1.9524 2.7724 2.3325 2.7533 1.7272 1.9895 1.6080 1.6118 3.6578 2.0563 1.7233 1.7920 5.5465 3.9812 2.7912 2.7280 1.0871 1.8503 1.8381 1.0989 1.0983 1.2998 1.3033 2.6775 2.6495 2.0484 4.6408 2.3127 2.3126 1.4904 1.4903 1.3109 1.3105 1.2748 1.2748 1.3501 1.3014 1.6791 1.4359 1.2458 1.2955 1.3154 1.3144 1.3562 1.3574 1.4890 1.5180 1.4770 1.4763 1.5466 1.5470 1.4851 1.5103 1.0857 1.0856 1.0899 1.0898 1.0903 1.0904 1.0826 1.0826 1.0972 1.0972 11.4657 10.8159 6.7153 1.0666 1.0665 1.0612 1.0612 1.0626 1.0627 1.0619 1.0619 1.0646 1.0647 1.0818 1.0818 1.0958 1.0957 1.0980 1.0980 1.1010 1.1010 1.1023 1.1023 1.1027 1.1027 1.0986 1.0867
irintensity: 0.8922 0.2017 0.6544 0.0044 0.0577 0.1891 1.4082 1.4491 0.6596 0.6916 2.3341 3.0583 5.6154 0.1214 11.4168 0.3755 2.2199 0.0009 1.8566 8.6489 14.9474 0.0728 4.5162 0.3361 5.3110 0.3449 0.0209 1.6437 2.9765 0.1210 14.8275 12.5290 1.9057 2.0993 1.4419 0.0187 4.5139 13.8274 0.0923 3.9444 4.4883 1.7906 19.9312 12.5670 0.0003 0.3928 0.0032 3.5067 287.5267 0.0270 219.6285 2.0859 56.0234 0.0492 3.4982 1.1135 0.2989 13.5439 2.9010 0.5341 11.1595 558.6848 0.4812 1.5464 0.5291 1.0708 0.6168 0.8560 0.2254 3.3625 3.1547 105.6339 0.0287 517.0723 0.0113 0.0704 84.2666 0.6341 0.3550 0.8828 0.4612 0.0389 3.1924 0.5292 0.4163 0.2457 1.0167 0.5303 0.8701 0.7015 2.7385 10.1160 3.8613 12.3144 16.0858 23.7414 19.1438 2.7725 3.0514 267.4272 0.3444 0.0027 59.0390 8.6663 15.7441 55.3229 67.4814 0.2022 1.2266 14.7836 29.6376 2.7042 36.2525 6.2087 132.1304 0.1605 46.0452 75.7397 54.3876 29.4694 1.0835 51.9383 35.0105 88.3445 0.0014 0.7891
temp: 298.150 k
press: 1.00000 atm
elementType: 8 8 8 8 6 6 6 6 6 6 6 6 6 6 6 6 6 6 6 6 1 1 1 1 1 1 1 1 1 1 1 1 1 1 1 1 1 1 1 1 1 1 1 1
symmnumber: 1
zpe: 984333.5 jmol-1
zpe.correction: 0.374913 hartree
zpe.thermalcorrener: 0.395002 hartree
zpe.thermalcorrenthalpy: 0.395946 hartree
zpe.thermalcorrgfe: 0.323266 hartree
zpe.sumelectzpe: -923.453688 hartree
zpe.sumelectthermal: -923.433599 hartree
zpe.sumelectthermalent: -923.432655 hartree
zpe.sumelectthermalfe: -923.505334 hartree
dipole: 0.0000 0.0000 0.2035
dipole: 0.2035
quadrupole: -84.1051 -128.8171 -117.7805
quadrupole: -5.1192 -0.0008 -0.0017
quadrupole: 26.1292 -18.5828 -7.5463 -5.1192 -0.0008 -0.0017
hfenergy: -923.8286007 hartree
pointgroup: C01 [X(C16H24O4)]
dipole: 0.0000073 0.0800806 0.0000128 debye
polarizability: 296.6118431|-0.0375171|137.9373877|3.8631479|-0.0066311|156.7955582 unknown
InChI: InChI=1S/C16H24O4/c17-15(19-13-7-3-1-4-8-13)11-12-16(18)20-14-9-5-2-6-10-14/h11-14H,1-10H2
charge 0 multiplicity 1
44 atoms
O  2.950724 0.096978 0.46813
O  -2.949463 0.098446 -0.46815
O  2.008282 0.108557 -1.679007
O  -2.007042 0.10819 1.679006
C  4.334271 0.050058 -0.121402
C  -4.333058 0.051873 0.121321
C  5.229399 -0.604927 0.938172
C  4.798102 1.472857 -0.482375
C  -5.228551 -0.60163 -0.938856
C  -4.79602 1.47464 0.483534
C  6.699527 -0.637215 0.448143
C  6.267119 1.438649 -0.97674
C  -6.698734 -0.633404 -0.44895
C  -6.265086 1.440921 0.977783
C  7.198887 0.777892 0.067851
C  -7.197212 0.781688 -0.067453
C  1.881106 0.116957 -0.427785
C  -1.879852 0.11731 0.427788
C  0.599319 0.130731 0.323556
C  -0.598053 0.131124 -0.323531
H  4.280086 -0.567246 -1.039967
H  -4.279272 -0.56627 1.039345
H  4.865248 -1.625139 1.159169
H  5.15989 -0.01858 1.875289
H  4.720625 2.111224 0.419954
H  4.136565 1.89835 -1.258123
H  -4.865039 -1.621885 -1.160707
H  -5.158605 -0.014527 -1.875468
H  -4.71809 2.113764 -0.418221
H  -4.134264 1.899025 1.2597
H  6.779937 -1.303503 -0.435532
H  7.341978 -1.074686 1.235491
H  6.605449 2.467626 -1.201844
H  6.320231 0.869985 -1.927885
H  -6.779635 -1.300417 0.434133
H  -7.341409 -1.069773 -1.236726
H  -6.602778 2.469911 1.203788
H  -6.318618 0.871443 1.928418
H  8.232497 0.723604 -0.324569
H  7.233158 1.410827 0.978525
H  -8.230884 0.72772 0.324845
H  -7.231005 1.415444 -0.977573
H  0.648097 0.129412 1.417658
H  -0.646827 0.130495 -1.417635
