program: Orca
programVersion: 5.0.2
elementType: O O O O O O N N N C C C C C C C C C C C C C C C C C H H H H H H H H H H H H H H H H H H H
charge: 0
multiplicity: 1
keywords: wb97x-d3
keywords: def2-TZVPP
keywords: def2/J RIJCOSX
keywords: DEFGRID2
keywords: scfconv7
keywords: smallprint printgap noloewdin
keywords: NOSOSCF
formula: C17H19N3O6
InChI: InChI=1/C17H19N3O6/c1-10(20-25-5)11-7-6-8-12(15(11)16(21)24-4)26-17-18-13(22-2)9-14(19-17)23-3/h6-9H,1-5H3
45 atoms
O  0.49075 -0.781906 -1.210799
O  -1.849107 1.025921 -1.48862
O  -0.846509 1.867967 0.324674
O  -4.74993 1.579362 1.327107
O  4.437742 0.743224 -2.747098
O  4.053523 -0.706153 1.648292
N  -3.697368 0.841609 0.899064
N  2.431667 -0.024424 -1.97141
N  2.234967 -0.750738 0.265996
C  -2.24077 -0.938797 1.189363
C  -1.334238 -0.460992 0.233498
C  -0.329872 -1.291477 -0.231978
C  -2.088153 -2.242756 1.652299
C  -3.365046 -0.111834 1.675339
C  -0.188295 -2.593421 0.218939
C  -1.0766 -3.060372 1.17005
C  -1.336703 0.947143 -0.276862
C  -4.029633 -0.451641 2.970418
C  1.779886 -0.512897 -0.940138
C  3.712268 0.246704 -1.759889
C  3.521358 -0.48103 0.459744
C  4.338095 0.029437 -0.538277
C  -1.881922 2.31567 -2.099931
C  -4.954635 2.680222 0.460533
C  3.810365 0.998203 -3.999676
C  3.228636 -1.237075 2.681336
H  -2.776164 -2.641123 2.38538
H  0.599816 -3.226691 -0.166466
H  -0.98498 -4.073264 1.538476
H  -3.301394 -0.804816 3.698913
H  -4.767906 -1.24499 2.833168
H  -4.545974 0.404182 3.398689
H  5.383871 0.247347 -0.376154
H  -2.450264 3.028139 -1.50145
H  -2.375309 2.178653 -3.058257
H  -0.87645 2.703631 -2.265597
H  -4.114443 3.378297 0.488035
H  -5.12499 2.358122 -0.569289
H  -5.845933 3.189875 0.823015
H  4.588317 1.408008 -4.639163
H  3.003383 1.7259 -3.907401
H  3.419997 0.085862 -4.451195
H  2.820906 -2.212471 2.413786
H  3.877829 -1.34808 3.546359
H  2.409679 -0.562586 2.932129
elementType: O N C H
totalener: -1274.93730901 hartree
nucrepener: 2416.98584707 hartree
electener: -3691.92315608 hartree
oneelecener: -6546.46345601 hartree
twoeener: 2854.54029994 hartree
cpcmener: -0.03547556 hartree
kineticenergy: 1269.78033459 hartree
xcener: -119.070345145256 hartree
chargesum: -0.0000000
charge: -0.299920 -0.264318 -0.435371 -0.254024 -0.294923 -0.294775 -0.132811 -0.406421 -0.414801 0.045802 -0.070030 0.261452 -0.181350 0.171556 -0.209354 -0.122841 0.415511 -0.257159 0.395478 0.418915 0.398519 -0.315554 -0.138312 -0.122190 -0.115336 -0.114077 0.150197 0.147796 0.160024 0.105919 0.117497 0.103561 0.140272 0.111165 0.129672 0.123071 0.108039 0.106432 0.124296 0.129072 0.113017 0.111509 0.109904 0.130932 0.113959
qa: -0.2999 -0.2643 -0.4354 -0.2540 -0.2949 -0.2948 -0.1328 -0.4064 -0.4148 0.0458 -0.0700 0.2615 -0.1813 0.1716 -0.2094 -0.1228 0.4155 -0.2572 0.3955 0.4189 0.3985 -0.3156 -0.1383 -0.1222 -0.1153 -0.1141 0.1502 0.1478 0.1600 0.1059 0.1175 0.1036 0.1403 0.1112 0.1297 0.1231 0.1080 0.1064 0.1243 0.1291 0.1130 0.1115 0.1099 0.1309 0.1140
va: 2.1046 2.1197 2.0646 1.9475 2.1238 2.1261 2.8623 2.9483 2.9274 3.7893 3.7914 3.7283 3.9320 3.8171 4.0115 3.9124 4.2044 3.9366 4.2609 4.0065 4.0492 3.9207 3.8755 3.8927 3.8527 3.8518 0.9963 1.0034 0.9899 0.9994 0.9957 1.0203 1.0174 0.9922 0.9947 0.9949 0.9897 0.9921 0.9944 0.9935 0.9960 0.9966 0.9932 0.9942 0.9957
dispcorr: -0.021440813 hartree
energy: -1274.958749821815
dipole: -10.23704 9.64770 -0.58933 4.80385 -5.66972 -0.86587 3.29460 -3.02439 0.27020
magnitude: 1.08169 au
magnitude: 2.74944 debye
