program: Orca
programVersion: 5.0.2
elementType: O O O O O O N N N C C C C C C C C C C C C C C C C C H H H H H H H H H H H H H H H H H H H
charge: 0
multiplicity: 1
keywords: wb97x-d3
keywords: def2-TZVPP
keywords: def2/J RIJCOSX
keywords: DEFGRID2
keywords: scfconv7
keywords: smallprint printgap noloewdin
keywords: NOSOSCF
formula: C17H19N3O6
InChI: InChI=1/C17H19N3O6/c1-10(20-25-5)11-7-6-8-12(15(11)16(21)24-4)26-17-18-13(22-2)9-14(19-17)23-3/h6-9H,1-5H3
45 atoms
O  1.041514 0.172199 1.049774
O  -1.28086 2.054408 0.971237
O  -1.168459 1.309381 -1.13556
O  -5.086209 1.049428 -0.066908
O  4.990766 1.631859 -0.543238
O  3.170978 -2.331189 -2.128448
N  -3.846459 0.63337 0.28626
N  2.986222 0.895261 0.267797
N  2.054441 -1.114344 -0.547918
C  -2.357416 -1.088211 0.737408
C  -1.233456 -0.255139 0.659944
C  -0.007633 -0.714458 1.109354
C  -2.196724 -2.36658 1.265592
C  -3.69778 -0.631087 0.313729
C  0.146644 -1.979766 1.650718
C  -0.9618 -2.803301 1.72206
C  -1.25486 1.11246 0.04917
C  -4.756212 -1.637274 -0.007063
C  2.069367 -0.04448 0.209976
C  4.026769 0.727964 -0.536718
C  3.108355 -1.271632 -1.341729
C  4.157058 -0.365553 -1.383467
C  -1.270134 3.409224 0.522654
C  -5.127699 2.463435 -0.113509
C  4.870764 2.771142 0.302121
C  2.117546 -3.287398 -2.082665
H  -3.046694 -3.030388 1.345042
H  1.112077 -2.312769 2.007756
H  -0.866034 -3.796303 2.139955
H  -5.242158 -1.994518 0.903813
H  -4.329047 -2.502689 -0.51125
H  -5.530438 -1.223235 -0.648551
H  5.011468 -0.498045 -2.031356
H  -2.108165 3.620365 -0.14139
H  -0.336201 3.652364 0.015312
H  -1.360213 4.019347 1.416613
H  -6.162494 2.729189 -0.322728
H  -4.833486 2.908685 0.839505
H  -4.494199 2.861072 -0.910063
H  5.763366 3.36515 0.122269
H  4.832929 2.492484 1.355592
H  3.990069 3.36555 0.057235
H  2.011062 -3.726021 -1.089874
H  1.163991 -2.85478 -2.386713
H  2.397822 -4.065773 -2.787998
elementType: O N C H
totalener: -1274.93722108 hartree
nucrepener: 2413.85095430 hartree
electener: -3688.78817538 hartree
oneelecener: -6540.21080077 hartree
twoeener: 2851.42262540 hartree
cpcmener: -0.03549221 hartree
kineticenergy: 1269.78479110 hartree
xcener: -119.071301467375 hartree
chargesum: 0.0000000
charge: -0.300037 -0.263669 -0.434781 -0.253636 -0.294805 -0.293987 -0.132791 -0.406733 -0.414244 0.053090 -0.077397 0.262697 -0.184105 0.169963 -0.210033 -0.121012 0.417412 -0.258197 0.393803 0.419311 0.399193 -0.315452 -0.140652 -0.122793 -0.114848 -0.114269 0.151008 0.146149 0.159909 0.116993 0.106465 0.104678 0.140558 0.111886 0.124375 0.129672 0.123872 0.107007 0.107681 0.129000 0.111517 0.112680 0.110070 0.113643 0.130811
qa: -0.3000 -0.2637 -0.4348 -0.2536 -0.2948 -0.2940 -0.1328 -0.4067 -0.4142 0.0531 -0.0774 0.2627 -0.1841 0.1700 -0.2100 -0.1210 0.4174 -0.2582 0.3938 0.4193 0.3992 -0.3155 -0.1407 -0.1228 -0.1148 -0.1143 0.1510 0.1461 0.1599 0.1170 0.1065 0.1047 0.1406 0.1119 0.1244 0.1297 0.1239 0.1070 0.1077 0.1290 0.1115 0.1127 0.1101 0.1136 0.1308
va: 2.1047 2.1198 2.0655 1.9483 2.1243 2.1259 2.8632 2.9486 2.9311 3.7915 3.7998 3.7317 3.9348 3.8181 4.0109 3.9115 4.2003 3.9376 4.2654 4.0054 4.0491 3.9208 3.8749 3.8933 3.8531 3.8519 0.9960 1.0045 0.9900 0.9955 0.9994 1.0198 1.0174 0.9920 0.9945 0.9947 0.9945 0.9922 0.9895 0.9936 0.9967 0.9960 0.9932 0.9955 0.9944
dispcorr: -0.021350214 hartree
energy: -1274.958571289377
dipole: -11.39321 10.87865 -0.51457 2.91231 -3.64399 -0.73168 -0.95140 1.66285 0.71144
magnitude: 1.14293 au
magnitude: 2.90509 debye
