program: Gaussian 09
title: 000073914
version: EM64L-G09RevD.01
frameworkgroup: C1[X(C11H12O3)]
method: RPBEPBE
basis: SDD
operation: Freq
keyword: #pfreq=noraman
keyword: PBEPBE/SDD
title: #p freq=noraman PBEPBE/SDD
converged: NO YES NO NO
title: Mulliken charges:
elementType: O O O C C C C C C C C C C C H H H H H H H H H H H H
charge: -0.212960 -0.419273 -0.223668 -0.377066 -0.511409 -0.474246 0.116033 0.284977 -0.342997 -0.345916 0.172162 -0.247189 -0.229339 -0.223702 0.240733 0.239406 0.231274 0.231638 0.245612 0.245898 0.244486 0.279107 0.230861 0.234527 0.234241 0.376811
chargesum: 0.00000
title: Mulliken charges with hydrogens summed into heavy atoms:
elementType: O O O C C C C C C C C C C C
charge: -0.212960 -0.042462 -0.223668 0.103072 -0.048497 0.017264 0.116033 0.284977 -0.098511 -0.066809 0.172162 -0.016327 0.005188 0.010539
polarizability: 1.79912861e+02 6.99864490e+00 1.30421205e+02 3.71596746e-01 -3.54448979e-02 6.33150106e+01
1716.lowfreq: -21.7018 -11.5929 -6.6246 -2.8513 -0.0010 -0.0006 -0.0005 28.0852 49.4619
frequency: -14.0437 27.9504 48.2524 58.5041 68.1552 108.7596 145.5382 160.0145 221.8514 267.3601 368.9027 400.0626 415.1343 445.3302 478.0357 499.9904 567.5099 590.4635 613.6553 636.0075 648.6169 696.9244 729.5961 771.3544 772.9417 854.9942 860.9097 869.4505 944.9085 975.6038 990.1608 991.4500 1011.1181 1022.8416 1030.8038 1056.1728 1076.3127 1087.6488 1093.4472 1139.9134 1173.4987 1187.8147 1206.8006 1242.2639 1254.0870 1281.9977 1284.3453 1315.3858 1346.7833 1376.8831 1389.1107 1430.6661 1436.2839 1438.6287 1469.0283 1479.7987 1573.2827 1601.1848 1614.8378 1674.9139 2958.3029 2985.2218 3005.7473 3027.3645 3031.8655 3088.4482 3130.0062 3139.4163 3151.0141 3160.2741 3170.8200 3514.8992
redmass: 10.9695 4.4643 2.0677 5.9199 3.2953 2.5733 6.9199 3.6608 6.3287 6.0079 6.0421 2.8126 3.1958 5.0142 5.1036 1.7875 2.2220 4.7506 6.4278 1.3130 6.2842 1.8408 1.2975 1.7189 4.9970 1.5149 1.3493 4.7648 1.4017 4.6273 6.2403 1.3780 1.3382 2.7605 2.2917 2.0411 1.9385 1.7296 3.1383 1.2344 1.0700 1.1278 1.8573 1.6417 1.2139 1.8912 1.0897 1.3594 1.8791 1.8599 9.2861 1.1369 1.8664 1.1686 1.0912 2.1987 6.8018 6.7716 6.7851 8.3613 1.0599 1.0608 1.0977 1.0612 1.0984 1.1028 1.0850 1.0880 1.0924 1.0960 1.1013 1.0639
irintensity: 0.0876 0.0502 1.6263 0.2326 1.5096 0.9248 0.3021 0.3002 0.3825 13.9923 0.5611 0.0534 0.7472 25.1765 42.0189 32.4344 2.4106 6.0910 0.3191 126.0529 4.1038 45.2256 64.9821 23.8325 1.6863 2.2204 0.0066 1.9274 2.8103 23.3958 3.4042 0.5540 0.4647 134.0210 150.0603 0.5595 5.9223 5.8931 59.9437 1.0181 3.1551 22.1499 34.1511 43.2674 0.3242 183.5376 8.9217 6.1855 4.9225 46.1951 2.3813 0.1693 21.7430 33.7692 16.3563 0.6006 82.4301 44.7948 12.1567 215.8547 24.1543 11.6726 11.3574 7.6821 4.2459 26.3304 0.3516 5.9688 19.4412 20.1263 21.1090 20.3794
temp: 298.150 k
press: 1.00000 atm
elementType: 8 8 8 6 6 6 6 6 6 6 6 6 6 6 1 1 1 1 1 1 1 1 1 1 1 1
symmnumber: 1
zpe: 537647.4 jmol-1
zpe.correction: 0.204779 hartree
zpe.thermalcorrener: 0.217535 hartree
zpe.thermalcorrenthalpy: 0.218479 hartree
zpe.thermalcorrgfe: 0.163332 hartree
zpe.sumelectzpe: -651.023738 hartree
zpe.sumelectthermal: -651.010982 hartree
zpe.sumelectthermalent: -651.010038 hartree
zpe.sumelectthermalfe: -651.065185 hartree
dipole: -1.9049 -4.3636 0.0149
dipole: 4.7613
quadrupole: -65.6814 -87.4721 -83.3591
quadrupole: -4.9976 0.2793 0.2415
quadrupole: 13.1562 -8.6345 -4.5216 -4.9976 0.2793 0.2415
hfenergy: -651.2285169 hartree
pointgroup: C01 [X(C11H12O3)]
dipole: 0.7555788 -1.7140852 0.0000277 debye
dipolederiv: -0.8268127 0.1003921 -0.0014972 0.2988135 -0.81369 0.0089392 -0.0034712 0.0065755 -0.2933166 -0.985341 -0.56146 -0.0211166 -0.5273804 -0.7105722 -0.0114312 -0.0213745 -0.01031 -0.4348451 -0.7175779 0.1863296 0.007049 -0.0793629 -0.9392886 -0.0223471 -0.0034617 -0.0229657 -0.3016465 0.0925872 0.0166773 -0.0003231 0.0040121 0.0421453 -0.0004099 0.0028241 -0.0013693 0.125469 -0.3229003 -0.1356788 0.0023738 -0.3933461 -0.1584281 0.0050674 0.005298 0.0048001 0.1688204 -0.2901271 0.0823319 0.0002542 0.2880053 -0.0582594 -0.0037989 -0.0040706 -0.0022994 0.1651338 1.729807 -0.1428896 0.0022053 -0.1250636 0.866546 -0.0123 0.0013554 -0.0103377 0.1087987 -0.7756853 0.1526686 -0.0022592 0.0841256 -0.1113889 0.0017023 -0.0015045 0.0014561 -0.0172775 0.1158477 0.0680972 -0.0002162 -0.1062837 0.0067338 -0.0019175 0.0016653 -0.0012885 -0.1322385 0.0111858 -0.1363892 0.001987 0.1187395 0.0362358 -0.0015023 -0.0021108 -0.001622 -0.1032026 1.5222644 0.1765108 0.0111942 0.2749653 1.4079262 0.043261 0.0201348 0.042305 0.1850272 -0.2443643 -0.0606278 0.000591 -0.1251386 0.1359444 -0.0035149 0.0012985 -0.0035312 -0.1572839 0.0079578 0.1937487 -0.0017725 0.1862523 -0.0444566 -0.0008175 -0.0017297 -0.0008095 -0.1549123 0.1301062 -0.0399514 0.0010082 -0.0098811 0.0300062 -0.0019562 0.0005812 -0.0019774 -0.1356871 0.0664804 -0.0024481 0.0137356 0.0076431 0.0226521 -0.0845609 0.0129933 -0.0748886 -0.0382287 0.064444 -0.0030824 -0.0140482 0.0090674 0.0231481 0.0846642 -0.0146206 0.0755006 -0.0414181 0.031581 0.0112089 0.0311589 0.0599052 0.006631 -0.0894848 0.0518642 -0.097988 -0.0302107 0.0303799 0.0117055 -0.0324689 0.0597602 0.0103614 0.0882921 -0.0536015 0.0972657 -0.0330508 0.0646763 0.0187942 -0.0098441 -0.0353458 0.0292441 0.0869736 0.0021989 0.105602 -0.0195572 0.0649387 0.01573 0.00885 -0.0382422 0.0287416 -0.0874332 0.0005253 -0.1063718 -0.019377 0.0019796 -0.1074261 0.000866 -0.124303 0.0194002 0.0012649 0.0009796 0.0012222 0.1395366 0.1381494 0.0474515 -0.0006084 -0.0027633 -0.0041623 0.0017758 0.0000813 0.0018795 0.1525209 0.0635534 0.0382398 -0.0005952 0.0635731 -0.110363 0.0031778 -0.0008058 0.0031703 0.1594327 -0.0488474 -0.0934517 0.0007353 -0.1082275 -0.0009215 0.0015922 0.0009074 0.0015214 0.158135 -0.1078888 0.0614 -0.001196 0.0630723 0.0752748 0.001058 -0.0012864 0.0010736 0.1576068 0.1836062 0.1021192 0.003937 0.1574033 0.2105396 -0.0062941 0.0053299 -0.0066126 0.3917714 unknown
polarizability: 179.9632314|-6.8207284|130.3710117|0.1882592|-0.2350382|63.3148331 unknown
InChI: InChI=1S/C11H12O3/c12-10(7-4-8-11(13)14)9-5-2-1-3-6-9/h1-3,5-6,13H,4,7-8H2
charge 0 multiplicity 1
26 atoms
O  0.287638 1.914069 -0.026221
O  -5.503955 -1.146921 -0.013473
O  -4.823784 1.071048 0.068467
C  -2.013654 0.312832 0.004167
C  -0.622673 -0.345914 0.004799
C  -3.131915 -0.744723 0.010913
C  0.525003 0.671283 -0.011873
C  1.942408 0.164322 -0.002608
C  2.260447 -1.220477 0.014025
C  2.997564 1.11675 -0.011428
C  -4.522642 -0.139927 0.024507
C  3.607239 -1.642344 0.021351
C  4.34123 0.695452 -0.003891
C  4.649767 -0.686624 0.012471
H  -2.114326 0.979149 0.878563
H  -2.116347 0.970421 -0.876689
H  -0.510145 -1.015144 -0.873918
H  -0.502586 -0.997077 0.895839
H  -3.051607 -1.411072 0.89312
H  -3.065726 -1.411028 -0.87177
H  1.464975 -1.972868 0.020991
H  2.731826 2.178934 -0.024334
H  3.845744 -2.711347 0.0340
H  5.147949 1.436243 -0.01074
H  5.69468 -1.016099 0.018304
H  -6.404911 -0.72344 0.001627
