program: Orca
programVersion: 5.0.2
elementType: O O O O O O N N N C C C C C C C C C C C C C C C C C H H H H H H H H H H H H H H H H H H H
charge: 0
multiplicity: 1
keywords: wb97x-d3
keywords: def2-TZVPP
keywords: def2/J RIJCOSX
keywords: DEFGRID2
keywords: scfconv7
keywords: smallprint printgap noloewdin
keywords: NOSOSCF
formula: C17H19N3O6
InChI: InChI=1/C17H19N3O6/c1-10(20-25-5)11-7-6-8-12(15(11)16(21)24-4)26-17-18-13(22-2)9-14(19-17)23-3/h6-9H,1-5H3
45 atoms
O  1.207377 -1.077015 1.101057
O  -1.380179 1.651003 1.772237
O  0.429073 1.591976 0.463443
O  -5.389897 1.169533 0.441688
O  2.469206 -0.621945 -3.254195
O  5.392242 0.351066 0.229619
N  -4.462578 0.200783 0.681138
N  1.799129 -0.870354 -1.088121
N  3.279161 -0.376723 0.681993
C  -2.325481 -0.618636 0.272825
C  -0.997683 -0.320888 0.601355
C  -0.067869 -1.351708 0.684305
C  -2.686022 -1.943347 0.051193
C  -3.352012 0.437803 0.109304
C  -0.434348 -2.667262 0.467551
C  -1.749843 -2.958462 0.154549
C  -0.550707 1.06597 0.914115
C  -3.08772 1.629057 -0.763136
C  2.127155 -0.753569 0.17751
C  2.738985 -0.536138 -1.960093
C  4.206611 -0.049242 -0.203477
C  3.99921 -0.103549 -1.576673
C  -1.082912 2.993369 2.132157
C  -6.582463 0.860559 1.123116
C  1.172273 -1.047648 -3.636129
C  5.598247 0.430401 1.630126
H  -3.710261 -2.170006 -0.208978
H  0.308025 -3.448938 0.554899
H  -2.046616 -3.98433 -0.017703
H  -3.234473 2.565907 -0.225665
H  -3.788224 1.636793 -1.60021
H  -2.082881 1.614707 -1.178972
H  4.761443 0.170057 -2.289656
H  -0.110538 3.069339 2.618859
H  -1.862637 3.295267 2.825501
H  -1.09017 3.65323 1.263698
H  -7.278765 1.667443 0.900979
H  -7.013249 -0.084381 0.782509
H  -6.431488 0.807092 2.203863
H  1.169458 -1.040626 -4.723304
H  0.398538 -0.375002 -3.264518
H  0.951426 -2.053524 -3.27737
H  5.489949 -0.54128 2.112873
H  6.617309 0.787373 1.75657
H  4.905239 1.126938 2.102575
totalener: -1274.91792804 hartree
nucrepener: 2420.15342106 hartree
electener: -3695.07134909 hartree
oneelecener: -6551.04482910 hartree
twoeener: 2855.97348000 hartree
kineticenergy: 1269.84366600 hartree
xcener: -119.071960836147 hartree
chargesum: 0.0000000
charge: -0.282344 -0.251523 -0.352714 -0.207598 -0.271108 -0.270602 -0.140609 -0.386581 -0.356687 0.092254 -0.073248 0.289462 -0.176112 0.157717 -0.176254 -0.092223 0.339369 -0.281297 0.360154 0.376945 0.402087 -0.304043 -0.143653 -0.112023 -0.117262 -0.120446 0.118885 0.120856 0.127684 0.099249 0.114644 0.098641 0.120253 0.120895 0.123130 0.106974 0.101067 0.092617 0.096971 0.119173 0.103749 0.102733 0.105333 0.116763 0.108721
qa: -0.2823 -0.2515 -0.3527 -0.2076 -0.2711 -0.2706 -0.1406 -0.3866 -0.3567 0.0923 -0.0732 0.2895 -0.1761 0.1577 -0.1763 -0.0922 0.3394 -0.2813 0.3602 0.3769 0.4021 -0.3040 -0.1437 -0.1120 -0.1173 -0.1204 0.1189 0.1209 0.1277 0.0992 0.1146 0.0986 0.1203 0.1209 0.1231 0.1070 0.1011 0.0926 0.0970 0.1192 0.1037 0.1027 0.1053 0.1168 0.1087
va: 2.1343 2.1352 2.1368 1.9706 2.1399 2.1376 2.8550 2.9169 2.9621 3.7129 3.7697 3.7945 4.0142 3.7313 4.0702 3.9391 4.1423 3.9605 4.2901 4.0792 4.0174 3.9290 3.8899 3.9268 3.8911 3.8802 1.0267 1.0098 0.9993 1.0064 1.0052 1.0101 1.0238 0.9967 0.9925 0.9940 0.9951 0.9959 0.9967 0.9940 0.9954 0.9964 0.9992 0.9926 0.9992
dispcorr: -0.021658959 hartree
energy: -1274.939586996426
dipole: -13.19413 12.28180 -0.91233 7.22120 -7.10560 0.11560 -0.58501 0.52823 -0.05678
magnitude: 0.92137 au
magnitude: 2.34194 debye
