program: Orca
programVersion: 5.0.2
elementType: O O O O O O N N N C C C C C C C C C C C C C C C C C H H H H H H H H H H H H H H H H H H H
charge: 0
multiplicity: 1
keywords: wb97x-d3
keywords: def2-TZVPP
keywords: def2/J RIJCOSX
keywords: DEFGRID2
keywords: scfconv7
keywords: smallprint printgap noloewdin
keywords: NOSOSCF
formula: C17H19N3O6
InChI: InChI=1/C17H19N3O6/c1-10(20-25-5)11-7-6-8-12(15(11)16(21)24-4)26-17-18-13(22-2)9-14(19-17)23-3/h6-9H,1-5H3
45 atoms
O  1.19956 -1.070069 1.090599
O  -1.380636 1.650477 1.78111
O  0.421134 1.600533 0.461158
O  -5.397852 1.176008 0.443095
O  2.487486 -0.644283 -3.260195
O  5.392447 0.34323 0.234632
N  -4.471335 0.204742 0.672931
N  1.803575 -0.876026 -1.096498
N  3.274477 -0.375106 0.679168
C  -2.332126 -0.608119 0.262342
C  -1.004325 -0.312888 0.593318
C  -0.074417 -1.343904 0.669697
C  -2.691813 -1.931195 0.029468
C  -3.358992 0.449126 0.107391
C  -0.440276 -2.657913 0.442461
C  -1.755227 -2.946757 0.125202
C  -0.555864 1.071708 0.914241
C  -3.09394 1.650891 -0.750651
C  2.124571 -0.752682 0.170358
C  2.749719 -0.550955 -1.965167
C  4.208202 -0.056559 -0.20301
C  4.00912 -0.119932 -1.577033
C  -1.082018 2.990341 2.148965
C  -6.591659 0.860618 1.11969
C  1.192148 -1.069763 -3.647693
C  5.590354 0.430841 1.635681
H  -3.715833 -2.156552 -0.23274
H  0.301931 -3.440337 0.524213
H  -2.051758 -3.971281 -0.055466
H  -2.089221 1.641193 -1.166903
H  -3.240001 2.580986 -0.201266
H  -3.794632 1.669634 -1.587362
H  4.776576 0.146316 -2.287228
H  -1.860178 3.288103 2.845871
H  -1.090665 3.655869 1.28487
H  -0.108641 3.06258 2.634276
H  -7.288241 1.668414 0.901754
H  -7.020554 -0.082291 0.771304
H  -6.442883 0.799614 2.200335
H  1.196075 -1.068963 -4.734858
H  0.417355 -0.393808 -3.284605
H  0.967462 -2.073282 -3.284693
H  4.897527 1.133402 2.099531
H  5.475029 -0.537204 2.124153
H  6.61017 0.784306 1.766031
totalener: -1274.91796669 hartree
nucrepener: 2418.91500061 hartree
electener: -3693.83296730 hartree
oneelecener: -6548.56578178 hartree
twoeener: 2854.73281449 hartree
kineticenergy: 1269.84292684 hartree
xcener: -119.071848737668 hartree
chargesum: -0.0000000
charge: -0.282420 -0.251466 -0.352182 -0.207389 -0.270996 -0.270595 -0.140811 -0.386651 -0.356816 0.092709 -0.073418 0.291004 -0.176298 0.157352 -0.176636 -0.091976 0.337768 -0.281467 0.360257 0.376609 0.401815 -0.303914 -0.143841 -0.112087 -0.117301 -0.120398 0.118887 0.120579 0.127648 0.099211 0.099243 0.114671 0.120330 0.123138 0.107017 0.120966 0.101106 0.092656 0.097016 0.119225 0.104128 0.102535 0.108698 0.105339 0.116752
qa: -0.2824 -0.2515 -0.3522 -0.2074 -0.2710 -0.2706 -0.1408 -0.3867 -0.3568 0.0927 -0.0734 0.2910 -0.1763 0.1574 -0.1766 -0.0920 0.3378 -0.2815 0.3603 0.3766 0.4018 -0.3039 -0.1438 -0.1121 -0.1173 -0.1204 0.1189 0.1206 0.1276 0.0992 0.0992 0.1147 0.1203 0.1231 0.1070 0.1210 0.1011 0.0927 0.0970 0.1192 0.1041 0.1025 0.1087 0.1053 0.1168
va: 2.1342 2.1348 2.1375 1.9709 2.1400 2.1375 2.8553 2.9172 2.9622 3.7135 3.7723 3.7924 4.0150 3.7311 4.0697 3.9387 4.1446 3.9604 4.2897 4.0799 4.0177 3.9290 3.8899 3.9268 3.8906 3.8803 1.0267 1.0099 0.9993 1.0101 1.0063 1.0052 1.0238 0.9925 0.9940 0.9967 0.9951 0.9960 0.9966 0.9940 0.9956 0.9964 0.9992 0.9992 0.9926
dispcorr: -0.021627388 hartree
energy: -1274.939594072761
dipole: -13.17561 12.26669 -0.90891 7.21598 -7.10184 0.11413 -0.52399 0.47011 -0.05388
magnitude: 0.91764 au
magnitude: 2.33244 debye
