program: Orca
programVersion: 5.0.2
elementType: O O O O O O N N N C C C C C C C C C C C C C C C C C H H H H H H H H H H H H H H H H H H H
charge: 0
multiplicity: 1
keywords: wb97x-d3
keywords: def2-TZVPP
keywords: def2/J RIJCOSX
keywords: DEFGRID2
keywords: scfconv7
keywords: smallprint printgap noloewdin
keywords: NOSOSCF
formula: C17H19N3O6
InChI: InChI=1/C17H19N3O6/c1-10(20-25-5)11-7-6-8-12(15(11)16(21)24-4)26-17-18-13(22-2)9-14(19-17)23-3/h6-9H,1-5H3
45 atoms
O  1.05915 1.073616 -1.073123
O  0.273749 0.554581 1.541917
O  -1.413466 2.020815 1.554455
O  -5.587459 0.408734 1.051188
O  2.557512 -3.180569 -0.423384
O  5.248037 0.500791 0.488955
N  -4.642598 0.552129 0.08395
N  1.771447 -1.068557 -0.770907
N  3.129063 0.802547 -0.298577
C  -2.455424 0.179837 -0.601649
C  -1.145102 0.581608 -0.318714
C  -0.195203 0.578128 -1.333272
C  -2.774011 -0.209519 -1.898729
C  -3.502245 0.118203 0.444648
C  -0.519129 0.195187 -2.621136
C  -1.816736 -0.195542 -2.898964
C  -0.795572 1.144761 1.018075
C  -3.22581 -0.512456 1.777538
C  2.019817 0.2184 -0.694875
C  2.750604 -1.8720 -0.381895
C  4.10021 -0.015459 0.077263
C  3.975012 -1.399699 0.068022
C  0.76695 1.084285 2.765506
C  -6.811591 0.940336 0.602337
C  1.299178 -3.65444 -0.876355
C  5.377538 1.913103 0.503154
H  -3.783927 -0.527311 -2.115664
H  0.237743 0.216025 -3.393369
H  -2.083598 -0.496741 -3.903101
H  -2.22373 -0.932565 1.825982
H  -3.932799 -1.323345 1.958513
H  -3.345635 0.203647 2.590008
H  4.771822 -2.056555 0.381127
H  1.050292 2.131306 2.659568
H  1.644611 0.493562 3.012253
H  0.030578 0.997779 3.564905
H  -7.173754 0.428821 -0.293091
H  -7.524677 0.787457 1.410611
H  -6.736981 2.009325 0.390149
H  1.358281 -4.738487 -0.823706
H  1.09606 -3.349598 -1.903379
H  0.481951 -3.300838 -0.247258
H  6.384732 2.111603 0.860509
H  5.250987 2.343095 -0.490575
H  4.654321 2.380315 1.172433
totalener: -1274.91782540 hartree
nucrepener: 2429.06799228 hartree
electener: -3703.98581768 hartree
oneelecener: -6568.45777640 hartree
twoeener: 2864.47195872 hartree
kineticenergy: 1269.84139635 hartree
xcener: -119.071041293933 hartree
chargesum: 0.0000000
charge: -0.281026 -0.266912 -0.329211 -0.205849 -0.268653 -0.267955 -0.143455 -0.376089 -0.354681 0.092354 -0.040976 0.270332 -0.167445 0.155674 -0.179766 -0.092387 0.321463 -0.281085 0.333974 0.372582 0.395911 -0.307920 -0.136720 -0.112809 -0.116144 -0.118079 0.119046 0.118334 0.127091 0.083751 0.109673 0.121672 0.123426 0.118396 0.112385 0.118044 0.090971 0.100697 0.100317 0.120684 0.103579 0.105691 0.119040 0.108583 0.103491
qa: -0.2810 -0.2669 -0.3292 -0.2058 -0.2687 -0.2680 -0.1435 -0.3761 -0.3547 0.0924 -0.0410 0.2703 -0.1674 0.1557 -0.1798 -0.0924 0.3215 -0.2811 0.3340 0.3726 0.3959 -0.3079 -0.1367 -0.1128 -0.1161 -0.1181 0.1190 0.1183 0.1271 0.0838 0.1097 0.1217 0.1234 0.1184 0.1124 0.1180 0.0910 0.1007 0.1003 0.1207 0.1036 0.1057 0.1190 0.1086 0.1035
va: 2.1294 2.1113 2.1762 1.9783 2.1428 2.1373 2.8650 2.9134 2.9370 3.7321 3.7439 3.8147 4.0023 3.7487 4.0667 3.9372 4.1885 3.9558 4.3135 4.0806 4.0050 3.9205 3.8911 3.9277 3.8841 3.8802 1.0285 1.0105 0.9995 1.0120 1.0066 1.0049 1.0235 0.9950 0.9940 0.9956 0.9957 0.9954 0.9960 0.9938 0.9965 0.9964 0.9925 0.9991 0.9983
dispcorr: -0.022243349 hartree
energy: -1274.940068754284
dipole: -8.82687 9.06831 0.24144 -3.06051 2.16309 -0.89743 6.74863 -6.70325 0.04538
magnitude: 0.93045 au
magnitude: 2.36501 debye
