program: Orca
programVersion: 5.0.2
elementType: O O O O O O N N N C C C C C C C C C C C C C C C C C H H H H H H H H H H H H H H H H H H H
charge: 0
multiplicity: 1
keywords: wb97x-d3
keywords: def2-TZVPP
keywords: def2/J RIJCOSX
keywords: DEFGRID2
keywords: scfconv7
keywords: smallprint printgap noloewdin
keywords: NOSOSCF
formula: C17H19N3O6
InChI: InChI=1/C17H19N3O6/c1-10(20-25-5)11-7-6-8-12(15(11)16(21)24-4)26-17-18-13(22-2)9-14(19-17)23-3/h6-9H,1-5H3
45 atoms
O  1.059786 1.00065 -1.042675
O  0.246387 0.633007 1.582414
O  -1.443109 2.093961 1.497546
O  -5.626139 0.467521 1.006779
O  2.590968 -3.228267 -0.306515
O  5.31599 0.482113 0.346351
N  -4.661424 0.553754 0.052128
N  1.784414 -1.129735 -0.687297
N  3.160176 0.756892 -0.346723
C  -2.462781 0.142303 -0.56898
C  -1.154258 0.554496 -0.290624
C  -0.191347 0.490932 -1.290608
C  -2.763684 -0.321678 -1.845577
C  -3.528037 0.144928 0.460814
C  -0.498244 0.034479 -2.558851
C  -1.792525 -0.369616 -2.831317
C  -0.818744 1.190779 1.016302
C  -3.276848 -0.400316 1.835579
C  2.035011 0.15913 -0.672301
C  2.782882 -1.918777 -0.317917
C  4.14944 -0.047233 0.011057
C  4.02653 -1.431005 0.055423
C  0.723346 1.231926 2.780489
C  -6.840288 0.970788 0.501277
C  1.31584 -3.718181 -0.689921
C  5.447977 1.893576 0.29636
H  -3.771539 -0.648596 -2.057967
H  0.269306 0.009189 -3.320456
H  -2.04624 -0.729134 -3.819468
H  -3.994268 -1.190438 2.058784
H  -3.399817 0.368653 2.59742
H  -2.279903 -0.824976 1.925763
H  4.839222 -2.076349 0.350585
H  -0.022349 1.188028 3.574279
H  1.005234 2.271989 2.619449
H  1.599409 0.659044 3.070625
H  -6.759567 2.024613 0.225186
H  -7.185309 0.405268 -0.368105
H  -7.569773 0.86851 1.302808
H  1.067055 -3.444929 -1.715944
H  0.525328 -3.347489 -0.03673
H  1.380786 -4.800172 -0.607145
H  6.471783 2.103019 0.595571
H  5.273607 2.282396 -0.707034
H  4.758896 2.389974 0.980313
totalener: -1274.91802444 hartree
nucrepener: 2422.24844314 hartree
electener: -3697.16646758 hartree
oneelecener: -6554.83615090 hartree
twoeener: 2857.66968332 hartree
kineticenergy: 1269.83941139 hartree
xcener: -119.070638846814 hartree
chargesum: -0.0000000
charge: -0.279934 -0.266582 -0.330881 -0.206251 -0.268624 -0.267944 -0.143563 -0.378161 -0.356745 0.095691 -0.047412 0.273168 -0.167311 0.156398 -0.178463 -0.092266 0.320613 -0.281450 0.339158 0.369908 0.394583 -0.305159 -0.136151 -0.112798 -0.115620 -0.118692 0.119029 0.118353 0.127500 0.109000 0.121980 0.084086 0.123575 0.116798 0.117726 0.112995 0.100318 0.090966 0.100801 0.102647 0.106099 0.120710 0.118806 0.108861 0.104238
qa: -0.2799 -0.2666 -0.3309 -0.2063 -0.2686 -0.2679 -0.1436 -0.3782 -0.3567 0.0957 -0.0474 0.2732 -0.1673 0.1564 -0.1785 -0.0923 0.3206 -0.2814 0.3392 0.3699 0.3946 -0.3052 -0.1362 -0.1128 -0.1156 -0.1187 0.1190 0.1184 0.1275 0.1090 0.1220 0.0841 0.1236 0.1168 0.1177 0.1130 0.1003 0.0910 0.1008 0.1026 0.1061 0.1207 0.1188 0.1089 0.1042
va: 2.1293 2.1144 2.1739 1.9779 2.1425 2.1379 2.8648 2.9139 2.9417 3.7272 3.7521 3.8124 4.0026 3.7494 4.0644 3.9369 4.1926 3.9568 4.3000 4.0837 4.0100 3.9202 3.8928 3.9279 3.8842 3.8789 1.0286 1.0104 0.9994 1.0071 1.0047 1.0118 1.0234 0.9951 0.9949 0.9945 0.9961 0.9957 0.9954 0.9963 0.9966 0.9937 0.9926 0.9991 0.9986
dispcorr: -0.021979429 hartree
energy: -1274.940003870594
dipole: -8.90733 9.16050 0.25317 -2.63590 1.74657 -0.88933 6.64540 -6.56896 0.07644
magnitude: 0.92781 au
magnitude: 2.35831 debye
