program: Orca
programVersion: 5.0.2
elementType: O O O O O O N N N C C C C C C C C C C C C C C C C C H H H H H H H H H H H H H H H H H H H
charge: 0
multiplicity: 1
keywords: wb97x-d3
keywords: def2-TZVPP
keywords: def2/J RIJCOSX
keywords: DEFGRID2
keywords: scfconv7
keywords: smallprint printgap noloewdin
keywords: NOSOSCF
formula: C17H19N3O6
InChI: InChI=1/C17H19N3O6/c1-10(20-25-5)11-7-6-8-12(15(11)16(21)24-4)26-17-18-13(22-2)9-14(19-17)23-3/h6-9H,1-5H3
45 atoms
O  1.145339 -1.295709 1.039078
O  -1.520137 0.935108 2.250712
O  0.033884 1.396419 0.709458
O  -4.210212 1.959006 -0.244018
O  2.189507 -0.029065 -3.208804
O  5.152131 0.645027 0.314613
N  -3.173908 1.083761 -0.193666
N  1.642922 -0.700965 -1.100445
N  3.131203 -0.342252 0.694097
C  -2.413151 -1.064488 0.245679
C  -1.122663 -0.694128 0.63895
C  -0.103709 -1.63502 0.588766
C  -2.646685 -2.373933 -0.163378
C  -3.513807 -0.08236 0.183878
C  -0.340917 -2.936411 0.183417
C  -1.620953 -3.303713 -0.189535
C  -0.801231 0.668514 1.164544
C  -4.913114 -0.495281 0.526197
C  2.002883 -0.748812 0.159746
C  2.508765 -0.135759 -1.928277
C  3.99197 0.204991 -0.150012
C  3.739015 0.34837 -1.508991
C  -1.349144 2.223045 2.81991
C  -3.745931 3.217602 -0.67653
C  0.901783 -0.471265 -3.60851
C  5.397809 0.531896 1.706081
H  -3.63847 -2.668002 -0.481165
H  0.473175 -3.648431 0.172132
H  -1.819422 -4.317127 -0.511257
H  -5.522526 -0.611224 -0.372441
H  -5.399072 0.2607 1.14143
H  -4.924674 -1.436074 1.070968
H  4.443494 0.809189 -2.184048
H  -2.006719 2.258846 3.684281
H  -1.629861 3.009238 2.117199
H  -0.319935 2.391098 3.137795
H  -3.003055 3.634337 0.008461
H  -3.307924 3.167661 -1.675839
H  -4.615988 3.871321 -0.699503
H  0.109561 0.057303 -3.077334
H  0.770111 -1.541135 -3.442917
H  0.836134 -0.25756 -4.672525
H  4.662184 1.082035 2.29343
H  5.392709 -0.507116 2.036877
H  6.384863 0.959121 1.865075
totalener: -1274.91765448 hartree
nucrepener: 2452.82869543 hartree
electener: -3727.74634991 hartree
oneelecener: -6616.76494990 hartree
twoeener: 2889.01859999 hartree
kineticenergy: 1269.84986029 hartree
xcener: -119.075041854851 hartree
chargesum: 0.0000000
charge: -0.283390 -0.258941 -0.350936 -0.211797 -0.272051 -0.271197 -0.146787 -0.380104 -0.358236 0.054855 -0.037542 0.293663 -0.182129 0.173407 -0.176248 -0.106589 0.356093 -0.282543 0.353436 0.381148 0.403200 -0.305413 -0.134916 -0.105915 -0.118410 -0.120071 0.126558 0.121911 0.127068 0.110053 0.104972 0.092954 0.120006 0.116688 0.099645 0.117292 0.084753 0.101807 0.105346 0.111660 0.100481 0.117059 0.108092 0.104849 0.116222
qa: -0.2834 -0.2589 -0.3509 -0.2118 -0.2721 -0.2712 -0.1468 -0.3801 -0.3582 0.0549 -0.0375 0.2937 -0.1821 0.1734 -0.1762 -0.1066 0.3561 -0.2825 0.3534 0.3811 0.4032 -0.3054 -0.1349 -0.1059 -0.1184 -0.1201 0.1266 0.1219 0.1271 0.1101 0.1050 0.0930 0.1200 0.1167 0.0996 0.1173 0.0848 0.1018 0.1053 0.1117 0.1005 0.1171 0.1081 0.1048 0.1162
va: 2.1292 2.1236 2.1491 1.9706 2.1415 2.1361 2.8520 2.9151 2.9634 3.7672 3.8116 3.7666 3.9683 3.7180 4.0835 3.9654 4.1945 3.9512 4.2961 4.0763 4.0132 3.9294 3.9046 3.9328 3.8856 3.8813 1.0026 1.0088 1.0009 0.9974 1.0125 1.0058 1.0238 0.9949 0.9912 0.9962 0.9879 0.9979 0.9933 0.9971 0.9960 0.9941 0.9993 0.9993 0.9926
dispcorr: -0.021953221 hartree
energy: -1274.939607700056
dipole: -12.52473 11.31667 -1.20805 6.96556 -7.15092 -0.18536 0.11240 -0.02201 0.09040
magnitude: 1.22553 au
magnitude: 3.11504 debye
