program: Orca
programVersion: 5.0.2
elementType: O O O O O O N N N C C C C C C C C C C C C C C C C C H H H H H H H H H H H H H H H H H H H
charge: 0
multiplicity: 1
keywords: wb97x-d3
keywords: def2-TZVPP
keywords: def2/J RIJCOSX
keywords: DEFGRID2
keywords: scfconv7
keywords: smallprint printgap noloewdin
keywords: NOSOSCF
formula: C17H19N3O6
InChI: InChI=1/C17H19N3O6/c1-10(20-25-5)11-7-6-8-12(15(11)16(21)24-4)26-17-18-13(22-2)9-14(19-17)23-3/h6-9H,1-5H3
45 atoms
O  1.019626 -1.309708 1.232213
O  0.042398 1.293028 1.137461
O  -1.02678 1.423661 -0.818312
O  -4.543777 1.937971 0.395014
O  2.08838 0.078468 -2.974985
O  5.087632 0.500539 0.551375
N  -3.63071 0.987739 0.733553
N  1.516296 -0.641515 -0.886546
N  3.03238 -0.420093 0.908407
C  -2.486122 -0.946874 0.176956
C  -1.16312 -0.588685 0.444714
C  -0.270487 -1.577153 0.862142
C  -2.88457 -2.273252 0.288157
C  -3.498945 0.084997 -0.149524
C  -0.675236 -2.895388 0.978679
C  -1.983424 -3.242403 0.689855
C  -0.728501 0.813216 0.171847
C  -4.229213 0.008607 -1.452164
C  1.883896 -0.763298 0.368349
C  2.402103 -0.084386 -1.703346
C  3.909418 0.124735 0.078883
C  3.653157 0.333523 -1.271354
C  0.602687 2.582239 0.929978
C  -4.636697 2.887902 1.429442
C  0.79276 -0.318925 -3.407306
C  5.348071 0.30259 1.931473
H  -3.914698 -2.540237 0.090138
H  0.041968 -3.639767 1.29712
H  -2.300353 -4.272026 0.786806
H  -5.256777 0.358227 -1.375774
H  -4.226938 -1.006396 -1.845237
H  -3.715535 0.641012 -2.18001
H  4.374219 0.78582 -1.934675
H  -0.171344 3.346442 0.856902
H  1.212948 2.61356 0.026335
H  1.228094 2.776469 1.7966
H  -3.686874 3.40335 1.593249
H  -5.383301 3.613812 1.111725
H  -4.956661 2.436026 2.371628
H  0.008211 0.21775 -2.87568
H  0.636403 -1.390047 -3.275746
H  0.753358 -0.074045 -4.465622
H  5.303303 -0.751576 2.205982
H  6.354237 0.67943 2.096499
H  4.644978 0.849855 2.560006
totalener: -1274.91753497 hartree
nucrepener: 2486.71426397 hartree
electener: -3761.63179894 hartree
oneelecener: -6684.07049054 hartree
twoeener: 2922.43869160 hartree
kineticenergy: 1269.84536205 hartree
xcener: -119.075284319746 hartree
chargesum: 0.0000000
charge: -0.260916 -0.247424 -0.371301 -0.210583 -0.264869 -0.267158 -0.137678 -0.377124 -0.350245 0.073701 0.022560 0.224002 -0.151851 0.150728 -0.172815 -0.110409 0.309038 -0.254742 0.313826 0.381396 0.398120 -0.308167 -0.145220 -0.105388 -0.125218 -0.118978 0.121375 0.125045 0.127774 0.101787 0.081316 0.115191 0.122829 0.119977 0.107536 0.123126 0.089426 0.100416 0.095083 0.121812 0.102981 0.118949 0.107731 0.118945 0.105416
qa: -0.2609 -0.2474 -0.3713 -0.2106 -0.2649 -0.2672 -0.1377 -0.3771 -0.3502 0.0737 0.0226 0.2240 -0.1519 0.1507 -0.1728 -0.1104 0.3090 -0.2547 0.3138 0.3814 0.3981 -0.3082 -0.1452 -0.1054 -0.1252 -0.1190 0.1214 0.1250 0.1278 0.1018 0.0813 0.1152 0.1228 0.1200 0.1075 0.1231 0.0894 0.1004 0.0951 0.1218 0.1030 0.1189 0.1077 0.1189 0.1054
va: 2.1486 2.1491 2.1060 1.9645 2.1483 2.1393 2.8751 2.9044 2.9383 3.7182 3.6465 3.8447 3.9511 3.7704 4.0493 3.9707 4.1400 3.9327 4.3468 4.0591 4.0003 3.9132 3.8967 3.9324 3.8616 3.8775 1.0074 1.0102 1.0001 1.0133 1.0095 1.0050 1.0243 0.9957 0.9940 0.9937 0.9936 0.9958 0.9966 1.0014 0.9974 0.9947 0.9994 0.9925 0.9988
dispcorr: -0.023689545 hartree
energy: -1274.941224520163
dipole: -8.39059 8.31510 -0.07549 7.45070 -7.60505 -0.15435 -1.39772 1.44462 0.04690
magnitude: 0.17811 au
magnitude: 0.45272 debye
