program: Orca
programVersion: 5.0.2
elementType: O O O O O O N N N C C C C C C C C C C C C C C C C C H H H H H H H H H H H H H H H H H H H
charge: 0
multiplicity: 1
keywords: wb97x-d3
keywords: def2-TZVPP
keywords: def2/J RIJCOSX
keywords: DEFGRID2
keywords: scfconv7
keywords: smallprint printgap noloewdin
keywords: NOSOSCF
formula: C17H19N3O6
InChI: InChI=1/C17H19N3O6/c1-10(20-25-5)11-7-6-8-12(15(11)16(21)24-4)26-17-18-13(22-2)9-14(19-17)23-3/h6-9H,1-5H3
45 atoms
O  0.501098 -1.336549 -1.335353
O  -0.434098 1.28827 -0.460665
O  -2.319555 0.741952 -1.537414
O  -4.005326 1.829871 1.855252
O  4.1459 0.915771 -2.733696
O  3.433761 0.178313 1.804549
N  -3.029858 0.99587 1.418997
N  2.300357 -0.228249 -2.036878
N  1.960216 -0.626662 0.263526
C  -2.315072 -1.168076 0.977919
C  -1.367763 -0.793338 0.019855
C  -0.368709 -1.687311 -0.331643
C  -2.231458 -2.436969 1.544029
C  -3.361009 -0.232246 1.435461
C  -0.288298 -2.947643 0.232022
C  -1.231261 -3.320249 1.172354
C  -1.461992 0.494779 -0.740361
C  -4.688349 -0.756485 1.892897
C  1.635828 -0.700661 -1.005828
C  3.420302 0.415365 -1.745354
C  3.07115 0.040512 0.539295
C  3.87217 0.603214 -0.444247
C  -0.366327 2.515916 -1.169594
C  -3.60901 3.16808 1.66116
C  3.687364 0.724484 -4.062311
C  2.576138 -0.357177 2.801218
H  -2.950707 -2.73827 2.29403
H  0.496091 -3.625394 -0.076138
H  -1.183733 -4.301511 1.624746
H  -5.492018 -0.078111 1.613694
H  -4.71928 -0.858767 2.979912
H  -4.895914 -1.730497 1.455761
H  4.778849 1.142608 -0.217237
H  -1.235449 3.142065 -0.964488
H  -0.294719 2.355081 -2.245495
H  0.532215 3.014983 -0.816749
H  -2.684412 3.398664 2.195468
H  -3.474103 3.399258 0.601454
H  -4.413846 3.784326 2.057846
H  3.620832 -0.332653 -4.320877
H  4.423159 1.209078 -4.699036
H  2.708847 1.177681 -4.224009
H  2.487916 -1.441052 2.720676
H  3.036135 -0.099444 3.751896
H  1.57535 0.072371 2.747816
totalener: -1274.91721833 hartree
nucrepener: 2467.74478569 hartree
electener: -3742.66200402 hartree
oneelecener: -6646.12955892 hartree
twoeener: 2903.46755490 hartree
kineticenergy: 1269.84832880 hartree
xcener: -119.075004625049 hartree
chargesum: 0.0000000
charge: -0.279432 -0.256736 -0.334944 -0.216999 -0.268465 -0.269552 -0.135532 -0.350107 -0.369392 0.039690 -0.003288 0.273625 -0.176544 0.183115 -0.179415 -0.110022 0.338751 -0.276597 0.317854 0.396384 0.375058 -0.308159 -0.145965 -0.121498 -0.118233 -0.118182 0.125486 0.119785 0.126357 0.107116 0.105756 0.095498 0.122659 0.109588 0.117958 0.114209 0.099502 0.097368 0.109223 0.107676 0.118390 0.105299 0.102216 0.119109 0.111386
qa: -0.2794 -0.2567 -0.3349 -0.2170 -0.2685 -0.2696 -0.1355 -0.3501 -0.3694 0.0397 -0.0033 0.2736 -0.1765 0.1831 -0.1794 -0.1100 0.3388 -0.2766 0.3179 0.3964 0.3751 -0.3082 -0.1460 -0.1215 -0.1182 -0.1182 0.1255 0.1198 0.1264 0.1071 0.1058 0.0955 0.1227 0.1096 0.1180 0.1142 0.0995 0.0974 0.1092 0.1077 0.1184 0.1053 0.1022 0.1191 0.1114
va: 2.1293 2.1116 2.1775 1.9750 2.1370 2.1428 2.8678 2.9382 2.9123 3.8215 3.7699 3.7923 3.9547 3.7384 4.0883 3.9706 4.2154 3.9474 4.3347 4.0052 4.0765 3.9180 3.9026 3.9246 3.8798 3.8816 1.0028 1.0095 1.0011 1.0171 0.9968 1.0036 1.0236 0.9959 0.9962 0.9938 0.9945 0.9912 0.9971 0.9993 0.9924 0.9983 0.9964 0.9936 0.9970
dispcorr: -0.022841706 hartree
energy: -1274.940060038258
dipole: -6.90006 7.05635 0.15629 7.57391 -7.51910 0.05481 6.21949 -5.28233 0.93715
magnitude: 0.95168 au
magnitude: 2.41897 debye
